Peptide,PTM,ModifiedAA,ModifiedPosition,PeptideUniqueToGene,ExperimentDesc,ExpID,PubmedID,ScoreType,IdentScore,LocProb,Log2FChange,PQ-val,QuantSig,PEP,MassErrorPPM
EVDQISDTKIPNMTK,ph,S,232,true,"Tissue atlas Arabidopsis - ProteomicsDB",114,32188942,"MaxQuant score",113.8800000,0.7530130,,,,8.872840226104E-6,
KVSFKPNPVTDYK,ph,S,244,true,"TOR Kinase and ABA Receptor",100,29290610,XCorr,2.7461245,0.9989000,,,,0.038219999521971,
KVSFKPNPVTDYK,ph,S,244,true,"Tissue atlas Arabidopsis - ProteomicsDB",114,32188942,"MaxQuant score",194.6700000,1.0000000,,,,6.6162097682925E-31,
VSFKPNPVTDYK,ph,S,244,true,"atm and atr DNA damage response",88,25561503,"MASCOT Score",30.0000000,1.0000000,,,,,-2.1800000
ETSEAVSGSLSVDGICTVR,ph,S,523,true,"Tissue atlas Arabidopsis - ProteomicsDB",114,32188942,"MaxQuant score",142.3000000,0.9974770,,,,3.2927201449539E-17,
SLNSELCK,ph,S,547,true,"Tissue atlas Arabidopsis - ProteomicsDB",114,32188942,"MaxQuant score",72.6070000,0.9999370,,,,0.012111400254071,
SLNSELCK,ph,S,550,true,"Tissue atlas Arabidopsis - ProteomicsDB",114,32188942,"MaxQuant score",71.6140000,0.9999920,,,,0.012486400082707,
DVNHISRPSVSGQTSQQLSCQSLDSLK,ph,S,563,true,"Tissue atlas Arabidopsis - ProteomicsDB",114,32188942,"MaxQuant score",279.6700000,0.9935830,,,,0,
AVCSGFPQEETYGSDKDDSAALNSSVIVTDDRR,ph,T,731,true,"Phosphorylation Early Elicitor Signaling",23,17317660,,,,,,,,
AVCSGFPQEETYGSDKDDSAALNSSVIVTDDRR,ph,S,734,true,"Tissue atlas Arabidopsis - ProteomicsDB",114,32188942,"MaxQuant score",138.3300000,0.9434430,,,,0,
TSLSTNTNPVDVLSVNELLESVSETAR,ph,T,843,true,"Large-scale phosphorylation discovery",44,23111157,XCorr,4.2620000,,,,,,
MSVLRSFKPQATK,ph,S,906,true,"TOR Kinase and ABA Receptor",100,29290610,XCorr,3.2304604,1.0000000,,,,0.00043340001138858,
SFKPQATK,ph,S,906,true,"atm and atr DNA damage response",88,25561503,"MASCOT Score",27.0000000,1.0000000,,,,,-2.9200000
AITSEDNEKDEQYLLK,ph,S,917,true,"Tissue atlas Arabidopsis - ProteomicsDB",114,32188942,"MaxQuant score",127.6200000,0.9815190,,,,1.874579993455E-7,
