Peptide,PTM,ModifiedAA,ModifiedPosition,PeptideUniqueToGene,ExperimentDesc,ExpID,PubmedID,ScoreType,IdentScore,LocProb,Log2FChange,PQ-val,QuantSig,PEP,MassErrorPPM
RSSQGDGSVTKPVR,ph,S,7,true,"Tissue atlas Arabidopsis - ProteomicsDB",114,32188942,"MaxQuant score",103.7300000,0.9864400,,,,3.6907698813593E-5,
SSQGDGSVTKPVR,ph,S,12,true,"Tissue atlas Arabidopsis - ProteomicsDB",114,32188942,"MaxQuant score",63.6140000,0.9625370,,,,0.0033920600544661,
ASNAAPIASDLRR,ph,S,80,true,"Tissue atlas Arabidopsis - ProteomicsDB",114,32188942,"MaxQuant score",76.5260000,0.9999900,,,,0.00026669801445678,
KDMDAELAPR,ub,K,132,true,"Arabidopsis ubiquitination COFRADIC",40,26744219,"MaxQuant Score",53.2370000,1.0000000,,,,0.0080000003799796,-1.0530000
RSTTIANKR,ac,K,156,true,"Quantitative Acetylproteomics",101,29440448,,,,,,,,
STTIANKR,ac,K,156,true,"Histone deacetylases- hda14 vs WT (low light)",98c,29061669,"MaxQuant Score",194.9000000,1.0000000,-0.0360000,0.9931160,NO,1.2999999853491E-5,
STTIANKR,ac,K,156,true,"Histone deacetylases - hda14 vs WT (thylakoids)",98d,29061669,"MaxQuant Score",69.8000000,1.0000000,0.7920000,0.6165950,NO,0.014000000432134,
STTIANKR,ac,K,156,true,"Quantitative Acetylproteomics",101,29440448,,,,,,,,
STTIANKR,ub,K,156,true,"Arabidopsis ubiquitination COFRADIC",40,26744219,"MaxQuant Score",79.4690000,1.0000000,,,,0.026000000536442,-0.3060000
LKTESGADQDTSEEK,ph,S,162,true,"Tissue atlas Arabidopsis - ProteomicsDB",114,32188942,"MaxQuant score",133.5300000,0.9995410,,,,0.0001970510056708,
LKTESGADQDTSEEK,ph,T,168,true,"Tissue atlas Arabidopsis - ProteomicsDB",114,32188942,"MaxQuant score",191.6200000,0.9831350,,,,2.1999499835204E-33,
FTRTDDSDDSLLVDELDQGPAIPWAR,ph,T,287,true,"Brassinosteroid-Regulated Phosphorylation Dynamics",94,26187819,"MaxQuant Score",128.6700000,0.7990000,,,,3.4360000031467E-16,-0.5270000
TDDSDDSLLVDELDQGPAIPWAR,ph,T,289,true,"Conserved plant phosphoproteome - Arabidopsis",61a,20466843,"MASCOT Score",71.0000000,1.0000000,,,,,
FTRTDDSDDSLLVDELDQGPAIPWAR,ph,S,292,true,"Brassinosteroid-Regulated Phosphorylation Dynamics",94,26187819,"MaxQuant Score",128.6700000,0.9400000,,,,3.4360000031467E-16,1.0370000
TDDSDDSLLVDELDQGPAIPWAR,ph,S,292,true,"Conserved plant phosphoproteome - Arabidopsis",61a,20466843,"MASCOT Score",72.0000000,1.0000000,,,,,
TDDSDDSLLVDELDQGPAIPWAR,ph,S,292,true,"TOR Kinase and ABA Receptor",100,29290610,XCorr,5.0990415,0.8559000,,,,5.0509999027781E-7,
FTRTDDSDDSLLVDELDQGPAIPWAR,ph,S,295,true,"Brassinosteroid-Regulated Phosphorylation Dynamics",94,26187819,"MaxQuant Score",128.6700000,0.9930000,,,,3.4360000031467E-16,1.0370000
TDDSDDSLLVDELDQGPAIPWAR,ph,S,295,true,"Conserved plant phosphoproteome - Arabidopsis",61a,20466843,"MASCOT Score",72.0000000,1.0000000,,,,,
TDDSDDSLLVDELDQGPAIPWAR,ph,S,295,true,"TOR Kinase and ABA Receptor",100,29290610,XCorr,5.0990415,0.9734000,,,,5.0509999027781E-7,
NVQPEVNLDRDYEGLKKPK,ac,K,1064,true,"Histone deacetylases- hda14 vs WT (low light)",98c,29061669,"MaxQuant Score",126.8000000,0.8550000,1.4970000,0.9885531,NO,8.1999997902926E-9,
DYEGLKK,ac,K,1064,true,"Histone deacetylases - apicidin vs control",98a,29061669,"MaxQuant Score",122.2000000,1.0000000,0.8290000,0.0053951,YES,0.00056999997468665,
DYEGLKK,ac,K,1064,true,"Histone deacetylases substrates - TSA vs control",98b,29061669,"MaxQuant Score",122.2000000,1.0000000,0.6090000,0.9204496,NO,0.00056999997468665,
KTTDAVSIDSAADK,ph,S,1074,true,"Tissue atlas Arabidopsis - ProteomicsDB",114,32188942,"MaxQuant score",148.1900000,0.9994620,,,,2.9787400990244E-7,
