Peptide,PTM,ModifiedAA,ModifiedPosition,PeptideUniqueToGene,ExperimentDesc,ExpID,PubmedID,ScoreType,IdentScore,LocProb,Log2FChange,PQ-val,QuantSig,PEP,MassErrorPPM
LVQAKNLTNK,ac,K,272,true,"Quantitative Acetylproteomics",101,29440448,,,,,,,,
NLTNKDLVGK,ac,K,277,true,"Quantitative Acetylproteomics",101,29440448,,,,,,,,
DLVGKSDPFAK,ac,K,282,true,"Quantitative Acetylproteomics",101,29440448,,,,,,,,
IYDDEGVQASELIGCAQIR,ox,C,346,true,"SPEAR - 50 mM H2O2 / mock",138b,34619326,,,,1.1462169,0.0153537,YES,,
LCELEPGK,sno,C,352,true,"hot5-4 / wildtype, FAT-switch S-nitrosoproteome",169,37277371,,,,,,,,
VLKNDTTDEENASSR,nt,V,412,true,"Metacaspase9 substrates - 35S:MC9 / mc9",51b,23964026,"MASCOT Score",53.0000000,,1.5610626,,NO,,-4.5457050
VLKNDTTDEENASSR,ac,K,414,true,"Quantitative Acetylproteomics",101,29440448,,,,,,,,
VLKNDTTDEENASSR,ub,K,414,true,"Arabidopsis ubiquitination COFRADIC",40,26744219,"MaxQuant Score",75.7640000,1.0000000,,,,2.2619999526796E-6,0.4380000
VLKNDTTDEENASSR,ph,T,417,true,"Tissue atlas Arabidopsis - ProteomicsDB",114,32188942,"MaxQuant score",85.9820000,0.9999740,,,,0.00056834297720343,
VLKNDTTDEENASSR,ph,T,418,true,"Tissue atlas Arabidopsis - ProteomicsDB",114,32188942,"MaxQuant score",93.5100000,0.9999230,,,,0.00014157200348563,
NDTTDEENASSR,ph,T,418,true,"atm and atr DNA damage response",88,25561503,"MASCOT Score",41.0000000,0.9970000,,,,,0.1200000
VLKNDTTDEENASSR,ph,S,424,true,"Tissue atlas Arabidopsis - ProteomicsDB",114,32188942,"MaxQuant score",153.0600000,0.9082990,,,,5.6833698858227E-10,
NDTTDEENASSR,ph,S,424,true,"atm and atr DNA damage response",88,25561503,"MASCOT Score",60.0000000,0.9480000,,,,,0.2100000
