Peptide,PTM,ModifiedAA,ModifiedPosition,PeptideUniqueToGene,ExperimentDesc,ExpID,PubmedID,ScoreType,IdentScore,LocProb,Log2FChange,PQ-val,QuantSig,PEP,MassErrorPPM
SVSGYKSDDEYSVIADK,ph,S,8,true,"Phospho cell culture sucrose/TOR",109,30833711,,,1.0000000,,,,,
SVSGYKSDDEYSVIADK,ph,S,8,true,"Tissue atlas Arabidopsis - ProteomicsDB",114,32188942,"MaxQuant score",312.4300000,1.0000000,,,,0,
SDDEYSVIADK,ph,S,8,true,"STN8 phosphoproteome",38,21768351,"MASCOT Score",52.6500000,,,,,,-1.5019600
SDDEYSVIADK,ph,S,8,true,"srk2dei ABA signaling phopshoproteomics",83,23572148,"MASCOT Score",39.0000000,,,,,,-0.0003000
VLVCAPSNSAADHILEK,so,C,450,true,"Arabidopsis S-sulfenylation chemoproteomics",108,31578252,"pFind PSM Score",0.0037837,,1.1884600,,,,0.2292862
EKNEWSDGWNSNGGGTK,ph,S,885,true,"Tissue atlas Arabidopsis - ProteomicsDB",114,32188942,"MaxQuant score",306.0100000,1.0000000,,,,0,
NEWSDGWNSNGGGTK,ph,S,885,true,"Tyrosine phosphorylation in Arabidopsis",59,18463617,"MASCOT Score",68.0000000,,,,,,-0.7110584
EKNEWSDGWNSNGGGTK,ph,S,890,true,"Tissue atlas Arabidopsis - ProteomicsDB",114,32188942,"MaxQuant score",249.2600000,0.9999870,,,,0,
NEWSDGWNSNGGGTK,ph,S,890,true,"Tyrosine phosphorylation in Arabidopsis",59,18463617,"MASCOT Score",55.0000000,,,,,,-0.3555291
NEWSDGWNSNGGGTK,ph,S,890,true,"Conserved plant phosphoproteome - Arabidopsis",61a,20466843,"MASCOT Score",55.0000000,1.0000000,,,,,
EECCDGWKDGGSGEEIK,ph,S,973,true,"Tyrosine phosphorylation in Arabidopsis",59,18463617,"MASCOT Score",38.0000000,,,,,,-1.3269568
DGGSGEEIK,ph,S,973,true,"atm and atr DNA damage response",88,25561503,"MASCOT Score",43.0000000,1.0000000,,,,,-1.3200000
GDFVAKEEDEWSDGWK,ph,S,998,true,"Tyrosine phosphorylation in Arabidopsis",59,18463617,"MASCOT Score",82.0000000,,,,,,-1.3658574
GDFVAKEEDEWSDGWK,ph,S,998,true,"srk2dei ABA signaling phopshoproteomics",83,23572148,"MASCOT Score",22.0000000,,,,,,0.0006000
GDFVAKEEDEWSDGWK,ph,S,998,true,"SnRK2 protein kinase substrates",85,23776212,XCorr,2.9694037,1.0000000,,,,4.911070163871E-7,
GDFVAKEEDEWSDGWK,ph,S,998,true,"Phospho cell culture sucrose/TOR",109,30833711,,,1.0000000,,,,,
GDFVAKEEDEWSDGWK,ph,S,998,true,"Tissue atlas Arabidopsis - ProteomicsDB",114,32188942,"MaxQuant score",282.3300000,1.0000000,,,,0,
EEDEWSDGWK,ph,S,998,true,"Tyrosine phosphorylation in Arabidopsis",59,18463617,"MASCOT Score",39.0000000,,,,,,-0.4413501
EEDEWSDGWK,ph,S,998,true,"srk2dei ABA signaling phopshoproteomics",83,23572148,"MASCOT Score",29.0000000,,,,,,0.0003000
