Peptide,PTM,ModifiedAA,ModifiedPosition,PeptideUniqueToGene,ExperimentDesc,ExpID,PubmedID,ScoreType,IdentScore,LocProb,Log2FChange,PQ-val,QuantSig,PEP,MassErrorPPM
SDTQHVQSSLVSIR,nt,S,6,true,"Arg/N-end rule seed, prt6 vs. Wt",99,29168982,"MASCOT Score",43.6700000,,,,,0.013410000130534,-1.2505568
SDTQHVQSSLVSIR,nta,S,6,true,"Arg/N-end rule pathway Roots",80,25728785,"MASCOT Score",67.6000000,,,,,3.2930000770648E-7,
SDTQHVQSSLVSIR,nta,S,6,true,"Arg/N-end rule seed, prt6 vs. Wt",99,29168982,"MASCOT Score",43.6700000,,,,,0.013410000130534,-1.2505568
SDTQHVQSSLVSIR,nta,S,6,true,"Arabidopsis translation initiation landscape - NTA",167a,35069635,,,,,,,,
SSDKIEDAFR,ph,S,20,true,"atm and atr DNA damage response",88,25561503,"MASCOT Score",36.0000000,0.9590000,,,,,-0.1700000
SSDKIEDAFR,ph,S,20,true,"Tissue atlas Arabidopsis - ProteomicsDB",114,32188942,"MaxQuant score",190.7800000,0.9421210,,,,2.9636799199657E-13,
GLSESSDQPECR,ph,S,259,true,"Tissue atlas Arabidopsis - ProteomicsDB",114,32188942,"MaxQuant score",109.1500000,0.9990570,,,,0.0001012360007735,
ISPTPNR,ph,S,361,false,"Phospho cell culture sucrose/TOR",109,30833711,,,0.9995840,,,,,
SDSKSLSNGKPDVK,ph,S,369,true,"Tissue atlas Arabidopsis - ProteomicsDB",114,32188942,"MaxQuant score",77.9960000,0.8950350,,,,0.00019423899357207,
SLSNGKPDVK,ph,S,371,true,"Tissue atlas Arabidopsis - ProteomicsDB",114,32188942,"MaxQuant score",144.8900000,0.9974000,,,,1.2361699646135E-6,
SLSNGKPDVK,ph,S,373,true,"Tissue atlas Arabidopsis - ProteomicsDB",114,32188942,"MaxQuant score",83.5730000,0.9996490,,,,0.0040835700929165,
KESSETEKPDNGEVQDLSEDASSP,ph,S,398,true,"Tissue atlas Arabidopsis - ProteomicsDB",114,32188942,"MaxQuant score",122.4700000,0.9999990,,,,7.3067702085712E-27,
ESSETEKPDNGEVQDLSEDASSP,ph,S,402,true,"Lateral root-induction - NAA vs control",106,23328941,"MASCOT Score",81.0000000,,,,,,
KESSETEKPDNGEVQDLSEDASSP,ph,S,403,true,"LAXIC - mannitol vs control",84b,23660473,XCorr,4.2200000,0.8990000,,,,0.0032709001097828,
ESSETEKPDNGEVQDLSEDASSP,ph,S,403,true,"Tissue atlas Arabidopsis - ProteomicsDB",114,32188942,"MaxQuant score",335.1200000,0.9997830,,,,0,
