Peptide,PTM,ModifiedAA,ModifiedPosition,PeptideUniqueToGene,ExperimentDesc,ExpID,PubmedID,ScoreType,IdentScore,LocProb,Log2FChange,PQ-val,QuantSig,PEP,MassErrorPPM
AGVSLKCGDCGTLLKSVEE,nt,A,2,true,"Arabidopsis translation initiation landscape - NT",167b,35069635,,,,,,,,
AGVSLKCGDC,nt,A,2,true,"N-term acetylation drought responses",5,26184543,,,,,,,,
AGVSLKCGDCGTLLKSVEE,nta,A,2,true,"Arabidopsis translation initiation landscape - NTA",167a,35069635,,,,,,,,
AGVSLKCGDC,nta,A,2,true,"N-term acetylation drought responses",5,26184543,,,,,,,,
SDLHTKRTGHTE,nt,S,58,true,"Arabidopsis translation initiation landscape - NT",167b,35069635,,,,,,,,
IESDLHTKR,ac,K,63,true,"Quantitative Acetylproteomics",101,29440448,,,,,,,,
TLETIKPISLEAPK,ph,S,82,true,"Tissue atlas Arabidopsis - ProteomicsDB",114,32188942,"MaxQuant score",116.2900000,0.9999420,,,,1.2830900232075E-5,
VPSNSNVGPAKPALTPEEVK,ph,T,177,true,"Tissue atlas Arabidopsis - ProteomicsDB",114,32188942,"MaxQuant score",156.0200000,1.0000000,,,,5.3519197779153E-29,
IGKELLEAKR,ub,K,216,true,"Arabidopsis ubiquitination COFRADIC",40,26744219,"MaxQuant Score",105.2000000,1.0000000,,,,4.7469998207816E-6,-1.1520000
IGKELLEAKR,ub,K,222,true,"Arabidopsis ubiquitination COFRADIC",40,26744219,"MaxQuant Score",74.6110000,1.0000000,,,,2.452000080666E-5,-0.1500000
KAEKEEEKR,ub,K,238,true,"Arabidopsis ubiquitination COFRADIC",40,26744219,"MaxQuant Score",145.9100000,1.0000000,,,,4.4090002120356E-6,-0.1950000
KAEKEEEKR,ub,K,241,true,"Arabidopsis ubiquitination COFRADIC",40,26744219,"MaxQuant Score",145.9100000,1.0000000,,,,4.4090002120356E-6,-0.1950000
KAEKEEEKR,ub,K,245,true,"Arabidopsis ubiquitination COFRADIC",40,26744219,"MaxQuant Score",145.9100000,1.0000000,,,,4.4090002120356E-6,-0.1950000
QKLEEDKAER,ub,K,254,true,"Arabidopsis ubiquitination COFRADIC",40,26744219,"MaxQuant Score",90.3060000,1.0000000,,,,0.00012070000229869,-0.3180000
PATKTEQMR,ub,K,299,true,"Arabidopsis ubiquitination COFRADIC",40,26744219,"MaxQuant Score",79.4890000,1.0000000,,,,0.0020000000949949,0.0860000
SLKQAHKEDDAKVKR,ub,K,311,true,"Arabidopsis ubiquitination COFRADIC",40,26744219,"MaxQuant Score",123.0200000,1.0000000,,,,1.0499999761451E-23,0.2420000
SLKQAHKEDDAKVKR,ub,K,315,true,"Arabidopsis ubiquitination COFRADIC",40,26744219,"MaxQuant Score",48.2160000,0.9310000,,,,0.0020000000949949,-0.0740000
LTNQTFQER,ph,T,353,true,"Tissue atlas Arabidopsis - ProteomicsDB",114,32188942,"MaxQuant score",153.2500000,1.0000000,,,,0.00055346597218886,
