Peptide,PTM,ModifiedAA,ModifiedPosition,PeptideUniqueToGene,ExperimentDesc,ExpID,PubmedID,ScoreType,IdentScore,LocProb,Log2FChange,PQ-val,QuantSig,PEP,MassErrorPPM
SETGAGKHVPRAVFVDLEPTVIDEVRTGTY,nt,S,54,false,"Arabidopsis translation initiation landscape - NT",167b,35069635,,,,,,,,
TGAGKHVPRAVFVDLEPTVIDE,nt,T,56,false,"Arabidopsis translation initiation landscape - NT",167b,35069635,,,,,,,,
TVGGGDDAFNTFFSETGAGKHVPR,ac,K,60,false,"Quantitative Acetylproteomics",101,29440448,,,,,,,,
AVFVDLEPTVIDEVR,nt,A,65,false,"HUNTER N-terminome: legumain, GluC and trypsin",119,31951383,"MaxQuant score",82.1710000,,,,,,
VDLEPTVIDEVR,nt,V,68,false,"Arg/N-end rule seed, prt6 vs. Wt",99,29168982,"MASCOT Score",42.9100000,,0.2956969,0.3986656,NO,0.0063080000691116,-1.6009663
VDLEPTVIDE,nt,V,68,false,"Arg/N-end rule seed, prt6 vs. Wt",99,29168982,"MASCOT Score",34.7300000,,,,,0.044780001044273,1.9500388
QLFHPEQLISGKEDAANNFAR,nt,Q,85,false,"HUNTER N-terminome: legumain, GluC and trypsin",119,31951383,"MaxQuant score",125.7900000,,,,,,
QLFHPEQLISGKEDAANNFAR,nt,Q,85,false,"Arabidopsis translation initiation landscape - NT",167b,35069635,,,,,,,,
HPEQLISGKEDAANNF,nt,H,88,false,"Arabidopsis translation initiation landscape - NT",167b,35069635,,,,,,,,
QLISGKE,nt,Q,91,false,"Arg/N-end rule seed, prt6 vs. Wt",99,29168982,"MASCOT Score",25.9100000,,,,,0.035480000078678,-1.5625244
QLFHPEQLISGKEDAANNFAR,cr,K,96,false,"Open search Plant PTM Viewer 2.0 - Crotonylation",164c,TBA,,,,,,,,
EDAANNFAR,nt,E,97,false,"Metacaspase9 substrates - in vitro rMC9",51c,23964026,"MASCOT Score",53.0000000,,5.6204049,,NO,,-0.0928946
DAANNFARGHYTIGKEIV,nt,D,98,false,"Arabidopsis translation initiation landscape - NT",167b,35069635,,,,,,,,
EIVDLCLDR,nt,E,113,false,"Metacaspase9 substrates - in vitro rMC9",51c,23964026,"MASCOT Score",49.0000000,,,,,,-0.4993334
EIVDLCLDR,ox,C,118,false,"OxiTRAQ Arabidopsis - 5 mM H2O2 versus control",47,24376095,,,,0.0159824,0.9023121,NO,,
EIVDLCLDR,sno,C,118,false,"hot5-4 / wildtype, FAT-switch S-nitrosoproteome",169,37277371,,,,,,,,
GHYTIGKEIVDLCLDR,so,C,118,false,"S-sulfenylation site detection using YAP1C",110,32714340,,,,,,,,
EIVDLCLDR,so,C,118,false,"Arabidopsis S-sulfenylation chemoproteomics",108,31578252,"pFind PSM Score",0.2418850,,2.2727300,,,,-1.5813358
AVGGGTGSGLGSLLLERLSV,nt,A,140,false,"Arabidopsis translation initiation landscape - NT",167b,35069635,,,,,,,,
AVGGGTGSGLGSLLLER,nt,A,140,false,"Arg/N-end rule seed, prt6 vs. Wt",99,29168982,"MASCOT Score",76.4000000,,-0.2363320,0.0182432,NO,9.8140000773128E-5,-0.7935783
AVGGGTGSGLGSLLLER,nt,A,140,false,"FtsH12 N-terminome: WT / FtsH12 knockdown miRNA",118,33216923,"MaxQuant score",76.3320000,,,,,0.012161999940872,
LSVDYGKK,ac,K,163,false,"Quantitative Acetylproteomics",101,29440448,,,,,,,,
LSVDYGKK,ub,K,163,false,"Ubiquitination Membrane Proteins",120,33585938,,,,,,,,
STHSLLEHTDVSIL,nt,S,190,false,"Arabidopsis translation initiation landscape - NT",167b,35069635,,,,,,,,
SLSIERPTYTNLNR,ph,S,216,false,"Tissue atlas Arabidopsis - ProteomicsDB",114,32188942,"MaxQuant score",142.9400000,0.9966820,,,,1.9196200184979E-7,
SLSIERPTYTNLNR,ph,S,218,false,"atm and atr DNA damage response",88,25561503,"MASCOT Score",28.0000000,1.0000000,,,,,0.3700000
SLSIERPTYTNLNR,ph,S,218,false,"Tissue atlas Arabidopsis - ProteomicsDB",114,32188942,"MaxQuant score",88.5650000,0.9980320,,,,6.9091700424906E-5,
EFQTNLVPYPR,nt,E,254,false,"FtsH12 N-terminome: WT / FtsH12 knockdown miRNA",118,33216923,"MaxQuant score",154.4700000,,1.8229346,0.0109914,YES,0,
LSSYAPVISAE,nt,L,269,false,"Arg/N-end rule seed, prt6 vs. Wt",99,29168982,"MASCOT Score",61.8900000,,-0.9344728,0.1701921,NO,9.0000003183377E-6,-1.6746524
SSYAPVISAE,nt,S,270,false,"Arg/N-end rule seed, prt6 vs. Wt",99,29168982,"MASCOT Score",28.0600000,,-0.2651925,0.2500523,NO,0.00045250001130626,-3.1217657
SYAPVISAE,nt,S,271,false,"Arg/N-end rule seed, prt6 vs. Wt",99,29168982,"MASCOT Score",43.5500000,,-0.4911948,0.0820176,NO,0.00062770000658929,-0.9053571
SVAEITNSAFEPASMMAKCDPR,nt,S,287,false,"Metacaspase9 substrates - Col-0 / mc9",51a,23964026,"MASCOT Score",70.0000000,,1.4033951,,NO,,-3.1259643
NSAFEPASMMAKCDPR,nt,N,293,false,"Metacaspase9 substrates - Col-0 / mc9",51a,23964026,"MASCOT Score",46.0000000,,1.0579682,,NO,,-2.1598438
CDPRHGK,so,C,305,false,"S-sulfenylation site detection using YAP1C",110,32714340,,,,,,,,
HGKYMACCLMYR,nt,H,309,false,"Arabidopsis translation initiation landscape - NT",167b,35069635,,,,,,,,
YMACCLMYR,acy,C,315,false,"Arabidopsis S-acylation atlas - Meristem",163a,35681017,,,,,,,,
YMACCLMYR,acy,C,315,false,"Arabidopsis S-acylation atlas - Hypocotyl",163b,35681017,,,,,,,,
YMACCLMYR,acy,C,315,false,"Arabidopsis S-acylation atlas - Silique",163e,35681017,,,,,,,,
YMACCLMYR,so,C,315,false,"Arabidopsis S-sulfenylation chemoproteomics",108,31578252,"pFind PSM Score",0.0899234,,1.0747300,,,,-0.3493128
YMACCLMYR,so,C,315,false,"S-sulfenylation site detection using YAP1C",110,32714340,,,,,,,,
YMACCLMYR,acy,C,316,false,"Arabidopsis S-acylation atlas - Meristem",163a,35681017,,,,,,,,
YMACCLMYR,acy,C,316,false,"Arabidopsis S-acylation atlas - Silique",163e,35681017,,,,,,,,
GDVVPKDVNAAVGTIK,ac,K,326,false,"Histone deacetylases - apicidin vs control",98a,29061669,"MaxQuant Score",59.6000000,1.0000000,-0.0200000,0.9727472,NO,2.1999999262334E-6,
GDVVPKDVNAAVGTIK,ac,K,326,false,"Histone deacetylases substrates - hda14 vs WT",98e,29061669,"MaxQuant Score",54.3000000,1.0000000,0.0860000,0.9120108,NO,0.00056000001495704,
GDVVPKDVNAAVGTIK,cr,K,326,false,"Open search Plant PTM Viewer 2.0 - Crotonylation",164c,TBA,,,,,,,,
DVNAAVGTIKTKRTIQFV,nt,D,327,false,"Arabidopsis translation initiation landscape - NT",167b,35069635,,,,,,,,
DVNAAVGTIKTKR,nt,D,327,false,"Metacaspase9 substrates - in vitro rMC9",51c,23964026,"MASCOT Score",58.0000000,,,,,,-0.5057178
DVNAAVGTIK,ph,T,334,false,"Tissue atlas Arabidopsis - ProteomicsDB",114,32188942,"MaxQuant score",141.1300000,1.0000000,,,,9.3528697107104E-6,
DVNAAVGTIKTK,cr,K,336,false,"Open search Plant PTM Viewer 2.0 - Crotonylation",164c,TBA,,,,,,,,
TIQFVDWCPTGFK,sno,C,347,false,"Site-specific nitrosomeproteomic id - gsnor1-3",90a,25699590,XCorr,3.7618690,,,,,5.2190000587871E-7,-4.5602018
TIQFVDWCPTGFK,sno,C,347,false,"Site-specific nitrosomeproteomic id - gsnor1-3",90b,25699590,XCorr,4.0579257,,,,,0.036609999835491,-7.0102780
TIQFVDWCPTGFK,so,C,347,false,"S-sulfenylation site detection using YAP1C",110,32714340,,,,,,,,
RTIQFVDWCPTGFK,ph,T,349,false,"srk2dei ABA signaling phopshoproteomics",83,23572148,"MASCOT Score",41.0000000,,,,,,-0.0002000
RTIQFVDWCPTGFK,ph,T,349,false,"Brassinosteroid-Regulated Phosphorylation Dynamics",94,26187819,"MaxQuant Score",142.8500000,1.0000000,,,,3.1899999157758E-5,2.3960000
RTIQFVDWCPTGFK,ph,T,349,false,"TOR Kinase and ABA Receptor",100,29290610,XCorr,3.2559817,1.0000000,,,,0.010759999975562,
TIQFVDWCPTGFK,ph,T,349,false,"Arabidopsis root NAA phosphoproteome",18a,27643528,"MaxQuant Score",116.0600000,1.0000000,,,,2.1139999473174E-11,-0.2750000
TIQFVDWCPTGFK,ph,T,349,false,"Phosphoproteome iron-deficient Arabidopsis roots",41,22438062,"MASCOT Score",59.6700000,,,,,,
TIQFVDWCPTGFK,ph,T,349,false,"Pollen phosphoproteome Arabidopsis",43,22631563,"MASCOT Score",72.6000000,,,,,,
TIQFVDWCPTGFK,ph,T,349,false,"Large-scale phosphorylation discovery",44,23111157,XCorr,4.1170000,,,,,,
TIQFVDWCPTGFK,ph,T,349,false,"srk2dei ABA signaling phopshoproteomics",83,23572148,"MASCOT Score",56.0000000,,,,,,0.0002000
TIQFVDWCPTGFK,ph,T,349,false,"SnRK2 protein kinase substrates",85,23776212,XCorr,3.6083372,1.0000000,,,,0.0016899999463931,
TIQFVDWCPTGFK,ph,T,349,false,"TOR Kinase and ABA Receptor",100,29290610,XCorr,4.5480337,1.0000000,,,,6.6150000748166E-6,
TIQFVDWCPTGFK,ph,T,349,false,"Lateral root-induction - NAA vs control",106,23328941,"MASCOT Score",39.0000000,,,,,,
TIQFVDWCPTGFK,ph,T,349,false,"Phospho cell culture sucrose/TOR",109,30833711,,,1.0000000,,,,,
TIQFVDWCPTGFK,ph,T,349,false,"Col-0 callus - FC Col-0 vs. Col-0 Xray",111a,31410901,,49.4500000,,-0.4743355,0.0000000,NO,,0.8507013
TIQFVDWCPTGFK,ph,T,349,false,"Col-0 X-ray callus - FC Col-0 vs. Col-0 Xray",111b,31410901,,49.4500000,,-0.4743355,0.0000000,NO,,0.8507013
TIQFVDWCPTGFK,ph,T,349,false,"atm callus - FC atm vs. atm Xray",111c,31410901,,49.4500000,,-0.9740693,0.0000000,NO,,0.8507013
TIQFVDWCPTGFK,ph,T,349,false,"atm-3 X-ray callus - FC atm vs. atm Xray",111d,31410901,,49.4500000,,-0.9740693,0.0000000,NO,,0.8507013
TIQFVDWCPTGFK,ph,T,349,false,"Tissue atlas Arabidopsis - ProteomicsDB",114,32188942,"MaxQuant score",302.4100000,1.0000000,,,,0,
TIQFVDWCPTGFK,ph,T,349,false,"Touch-induced phosphorylation: 40s touch vs untouc",136,30291188,"MASCOT score",55.8700000,,1.0738879,0.0293382,YES,,4.0351855
CGINYQPPTVVPGGDLAK,acy,C,353,false,"Arabidopsis S-acylation atlas - Seedling",163d,35681017,,,,,,,,
CGINYQPPTVVPGGDLAK,sno,C,353,false,"Site-specific nitrosomeproteomic id - gsnor1-3",90a,25699590,XCorr,2.9341934,,,,,0.13289999961853,-6.9655131
CGINYQPPTVVPGGDLAK,sno,C,353,false,"Site-specific nitrosomeproteomic id - gsnor1-3",90b,25699590,XCorr,3.9100000,,,,,0.044690001755953,-3.4300000
CGINYQPPTVVPGGDLAK,sno,C,353,false,"hot5-4 / wildtype, FAT-switch S-nitrosoproteome",169,37277371,,,,,,,,
CGINYQPPTVVPGGDLAK,so,C,353,false,"S-sulfenylation site detection using YAP1C",110,32714340,,,,,,,,
AVCMISNSTSVAEVFSR,acy,C,376,false,"Arabidopsis S-acylation atlas - Silique",163e,35681017,,,,,,,,
AVCMISNSTSVAEVFSR,ox,C,376,false,"SPEAR - 50 mM H2O2 / mock",138b,34619326,,,,2.6568081,0.0093842,YES,,
AVCMISNSTSVAEVFSR,so,C,376,false,"Arabidopsis S-sulfenylation chemoproteomics",108,31578252,"pFind PSM Score",0.0000068,,1.6514100,,,,-1.1132064
AVCMISNSTSVAEVFSR,so,C,376,false,"S-sulfenylation site detection using YAP1C",110,32714340,,,,,,,,
MISNSTSVAE,nt,M,377,false,"Arg/N-end rule seed, prt6 vs. Wt",99,29168982,"MASCOT Score",54.8500000,,-0.1272618,0.2421748,NO,0.0016210000030696,-1.3473612
SRIDHKFDLMY,nt,S,389,false,"Arabidopsis translation initiation landscape - NT",167b,35069635,,,,,,,,
IDHKFDLMYAKR,nt,I,391,false,"Arabidopsis translation initiation landscape - NT",167b,35069635,,,,,,,,
IDHKFDLMYAKR,ac,K,394,false,"Quantitative Acetylproteomics",101,29440448,,,,,,,,
IDHKFDLMYAK,ac,K,394,false,"Histone deacetylases substrates - TSA vs control",98b,29061669,"MaxQuant Score",44.5000000,1.0000000,0.4190000,0.8413951,NO,0.0070000002160668,
IDHKFDLMYAK,ac,K,394,false,"Quantitative Acetylproteomics",101,29440448,,,,,,,,
IDHKFDLMYAKR,ac,K,401,false,"Quantitative Acetylproteomics",101,29440448,,,,,,,,
FDLMYAKR,ac,K,401,false,"Quantitative Acetylproteomics",101,29440448,,,,,,,,
DYEEVGAEGGDDEDDEGEEY,nt,D,431,false,"Metacaspase9 substrates - 35S:MC9 / mc9",51b,23964026,"MASCOT Score",52.0000000,,5.3867264,,NO,,-1.0894104
EVGAEGGDDEDDEGEEY,nt,E,434,false,"Metacaspase9 substrates - in vitro rMC9",51c,23964026,"MASCOT Score",45.0000000,,2.3118072,,NO,,-0.7432292
