Peptide,PTM,ModifiedAA,ModifiedPosition,PeptideUniqueToGene,ExperimentDesc,ExpID,PubmedID,ScoreType,IdentScore,LocProb,Log2FChange,PQ-val,QuantSig,PEP,MassErrorPPM
AQQSLIYSFV,nt,A,2,false,"N-term acetylation drought responses",5,26184543,,,,,,,,
AQQSLIY,nt,A,2,false,"Arg/N-end rule seed, prt6 vs. Wt",99,29168982,"MASCOT Score",41.5200000,,-0.6261389,0.3060718,NO,0.21750000119209,0.2464643
AQQSLIYSFVAR,nta,A,2,false,"Characterization plant N-terminal acetylation",6,22223895,"MASCOT Score",73.8000000,,,,,,
AQQSLIYSFVAR,nta,A,2,false,"FtsH12 N-terminome: WT / FtsH12 knockdown miRNA",118,33216923,"MaxQuant score",84.9330000,,,,,3.0700000376062E-13,
AQQSLIYSFVAR,nta,A,2,false,"HUNTER N-terminome: legumain, GluC and trypsin",119,31951383,"MaxQuant score",87.2980000,,,,,,
AQQSLIYSFVAR,nta,A,2,false,"Arabidopsis translation initiation landscape - NTA",167a,35069635,,,,,,,,
GNFTSIAAQCLQK,acy,C,35,false,"Arabidopsis S-acylation atlas - Meristem",163a,35681017,,,,,,,,
GNFTSIAAQCLQK,ox,C,35,false,"SPEAR - 50 mM H2O2 / mock",138b,34619326,,,,0.7722407,0.0473696,YES,,
GNFTSIAAQCLQK,sno,C,35,false,"hot5-4 / wildtype, FAT-switch S-nitrosoproteome",169,37277371,,,,-0.2458091,0.0390232,NO,,
VKEDFNKR,ub,K,86,false,"Arabidopsis ubiquitination COFRADIC",40,26744219,"MaxQuant Score",52.5790000,1.0000000,,,,0.020999999716878,3.1400000
VKEDFNKR,ac,K,91,false,"Quantitative Acetylproteomics",101,29440448,,,,,,,,
YGGGKAATAQANSLNKEFGSK,ub,K,97,false,"Ubiquitination Membrane Proteins",120,33585938,,,,,,,,
YGGGKAATAQANSLNK,ub,K,97,false,"Ubiquitination Membrane Proteins",120,33585938,,,,,,,,
YGGGKAATAQANSLNK,ub,K,97,false,"upl3 mutant / wildtype",168,35926874,"MaxQuant score",108.6600000,1.0000000,-0.7833899,0.6180800,NO,3.0033199038826E-8,3.0846000
AATAQANSLNK,ph,S,105,false,"Tissue atlas Arabidopsis - ProteomicsDB",114,32188942,"MaxQuant score",110.5600000,0.9999980,,,,4.4910200358572E-7,
AATAQANSLNKEFGSK,ub,K,108,false,"Ubiquitination Membrane Proteins",120,33585938,,,,,,,,
AATAQANSLNKEFGSK,ub,K,108,false,"upl3 mutant / wildtype",168,35926874,"MaxQuant score",114.6300000,1.0000000,0.2178511,0.4277400,NO,4.4412498567681E-8,-0.5388500
EFGSKLK,ac,K,113,false,"Quantitative Acetylproteomics",101,29440448,,,,,,,,
EHMQYCMDHPDEISK,so,C,121,false,"Arabidopsis S-sulfenylation chemoproteomics",108,31578252,"pFind PSM Score",0.0007673,,1.3228200,,,,-0.3186938
VKAQVSEVK,ub,K,135,false,"Ubiquitination Membrane Proteins",120,33585938,,,,,,,,
VKAQVSEVK,ub,K,135,false,"upl3 mutant / wildtype",168,35926874,"MaxQuant score",75.3870000,1.0000000,0.4604805,,,0.013933800160885,0.9303800
VKAQVSEVK,ph,S,139,false,"Tissue atlas Arabidopsis - ProteomicsDB",114,32188942,"MaxQuant score",65.9490000,1.0000000,,,,0.00095278001390398,
AQVSEVKGVMMENIEK,ub,K,142,false,"Ubiquitination Membrane Proteins",120,33585938,,,,,,,,
AQVSEVKGVMMENIEK,ub,K,142,false,"upl3 mutant / wildtype",168,35926874,"MaxQuant score",86.3670000,1.0000000,-0.8809759,0.5261400,NO,9.6163803391391E-6,-0.3332400
GVMMENIEKVLDR,ub,K,151,false,"upl3 mutant / wildtype",168,35926874,"MaxQuant score",110.3800000,1.0000000,1.0600474,,,1.5670699212933E-5,0.4242600
GEKIELLVDKTENLR,nt,G,156,false,"Metacaspase9 substrates - Col-0 / mc9",51a,23964026,"MASCOT Score",105.0000000,,1.4021611,,NO,,-2.0220986
GEKIELLVDKTENLR,nt,G,156,false,"Metacaspase9 substrates - 35S:MC9 / mc9",51b,23964026,"MASCOT Score",77.0000000,,1.3463152,,NO,,-2.7465485
VLDRGEKIELLVDK,ub,K,158,false,"upl3 mutant / wildtype",168,35926874,"MaxQuant score",88.7680000,1.0000000,-0.9885044,0.2846400,NO,0.00010795499838423,-1.5633000
IELLVDKTENLR,ub,K,165,false,"Ubiquitination Membrane Proteins",120,33585938,,,,,,,,
IELLVDKTENLR,ub,K,165,false,"upl3 mutant / wildtype",168,35926874,"MaxQuant score",197.0700000,1.0000000,0.0257376,0.9634600,NO,5.6119799824961E-18,-2.6329000
IELLVDKTENLR,ph,T,166,false,"TOR Kinase and ABA Receptor",100,29290610,XCorr,2.6856084,1.0000000,,,,1.1750000339816E-5,
IELLVDKTENLR,ph,T,166,false,"Tissue atlas Arabidopsis - ProteomicsDB",114,32188942,"MaxQuant score",192.4600000,1.0000000,,,,1.3340300550448E-23,
SQAQDFR,ph,S,171,false,"Tissue atlas Arabidopsis - ProteomicsDB",114,32188942,"MaxQuant score",149.7300000,1.0000000,,,,1.7419100211387E-18,
