Peptide,PTM,ModifiedAA,ModifiedPosition,PeptideUniqueToGene,ExperimentDesc,ExpID,PubmedID,ScoreType,IdentScore,LocProb,Log2FChange,PQ-val,QuantSig,PEP,MassErrorPPM
MEFPGSSNQHLGR,nta,M,3,true,"Arabidopsis translation initiation landscape - NTA",167a,35069635,,,,,,,,
DRFNGEVGCGNNCSQTGEEFSNEFLR,ph,S,29,true,"Tissue atlas Arabidopsis - ProteomicsDB",114,32188942,"MaxQuant score",86.2480000,0.9168280,,,,1.3456799727535E-15,
VDSNMSEGINSSNGYFAESNVADSPRK,ph,S,104,true,"Tissue atlas Arabidopsis - ProteomicsDB",114,32188942,"MaxQuant score",63.7270000,0.9736650,,,,4.6465700620502E-7,
VFLVPSTESSESPKIFHER,ph,S,229,true,"Tissue atlas Arabidopsis - ProteomicsDB",114,32188942,"MaxQuant score",160.5700000,0.9987530,,,,9.837669778845E-23,
VFLVPSTESSESPK,ph,S,229,true,"Large-scale phosphorylation discovery",44,23111157,XCorr,2.6050000,,,,,,
NTNQQTDIDHYQYVSALNGIVDVSPQK,ph,S,266,true,"Tissue atlas Arabidopsis - ProteomicsDB",114,32188942,"MaxQuant score",146.0100000,1.0000000,,,,0,
SSSGQSGTSQTTQFGNASEFSPTFHLR,ph,S,290,true,"Tissue atlas Arabidopsis - ProteomicsDB",114,32188942,"MaxQuant score",222.6000000,0.9524740,,,,0,
DSPTSVHTWEHK,ph,S,298,true,"Tissue atlas Arabidopsis - ProteomicsDB",114,32188942,"MaxQuant score",258.7800000,0.9993490,,,,0,
DSNSPTFMKPYGNTNAVHFMPK,ph,S,312,true,"Tissue atlas Arabidopsis - ProteomicsDB",114,32188942,"MaxQuant score",248.6300000,0.9999990,,,,0,
NSFGQQSPPTSPFSVHK,ph,S,337,true,"Tissue atlas Arabidopsis - ProteomicsDB",114,32188942,"MaxQuant score",127.2200000,1.0000000,,,,1.1987999481988E-9,
NSFGQQSPPTSPFSVHK,ph,S,342,true,"Tissue atlas Arabidopsis - ProteomicsDB",114,32188942,"MaxQuant score",170.0600000,0.9999020,,,,3.8615501141392E-22,
NSFGQQSPPTSPFSVHK,ph,S,346,true,"Tissue atlas Arabidopsis - ProteomicsDB",114,32188942,"MaxQuant score",138.7500000,0.9031360,,,,1.9022999842022E-10,
RPSDDIYPHGQAYIGAEK,ph,S,405,true,"Pollen phosphoproteome Arabidopsis",43,22631563,"MASCOT Score",48.6600000,,,,,,-2.4764300
RPSDDIYPHGQAYIGAEK,ph,S,405,true,"Tissue atlas Arabidopsis - ProteomicsDB",114,32188942,"MaxQuant score",210.3900000,1.0000000,,,,0,
NALSDPQLHDESQINNGLEAFTK,ph,S,429,true,"Tissue atlas Arabidopsis - ProteomicsDB",114,32188942,"MaxQuant score",208.1900000,1.0000000,,,,0,
DNNPDSFDQATK,ph,S,504,true,"Tissue atlas Arabidopsis - ProteomicsDB",114,32188942,"MaxQuant score",124.4700000,0.9999790,,,,3.5499899240676E-5,
SHTSATDQLCSTTK,ph,S,585,true,"Tissue atlas Arabidopsis - ProteomicsDB",114,32188942,"MaxQuant score",203.7600000,0.9809720,,,,5.0811082316418E-42,
HDLETNSDDSDTQK,ph,S,629,true,"Tissue atlas Arabidopsis - ProteomicsDB",114,32188942,"MaxQuant score",250.1900000,0.9950800,,,,0,
HDLETNSDDSDTQK,ph,S,632,true,"Tissue atlas Arabidopsis - ProteomicsDB",114,32188942,"MaxQuant score",163.7400000,0.9873500,,,,5.2004400785677E-11,
EESIHYSGLPLR,ph,S,643,true,"Tissue atlas Arabidopsis - ProteomicsDB",114,32188942,"MaxQuant score",85.1630000,0.9999920,,,,0.00051395100308582,
EESIHYSGLPLR,ph,S,647,true,"Tissue atlas Arabidopsis - ProteomicsDB",114,32188942,"MaxQuant score",212.1000000,0.9979160,,,,1.1597100477783E-31,
ETTFMHTQGSDDFFK,ph,S,667,true,"Tissue atlas Arabidopsis - ProteomicsDB",114,32188942,"MaxQuant score",322.6800000,0.9999840,,,,0,
EITNADHESEMEEK,ph,S,727,true,"Tissue atlas Arabidopsis - ProteomicsDB",114,32188942,"MaxQuant score",134.9300000,0.9999990,,,,6.9497100412264E-6,
GTDVAIKR,ac,K,793,false,"Quantitative Acetylproteomics",101,29440448,,,,,,,,
NSCFSGGSSEQAR,ph,S,804,true,"Tissue atlas Arabidopsis - ProteomicsDB",114,32188942,"MaxQuant score",178.6700000,0.9963130,,,,1.1024400065352E-21,
NSCFSGGSSEQAR,ph,S,805,true,"Tissue atlas Arabidopsis - ProteomicsDB",114,32188942,"MaxQuant score",164.6600000,0.9968740,,,,1.0645600205398E-13,
RNTLVSGGVR,ph,T,927,false,"Ph protein kinases and peptide chip analysis",27,18433157,,,,,,,,
RNTLVSGGVR,ph,T,927,false,"srk2dei ABA signaling phopshoproteomics",83,23572148,"MASCOT Score",35.0000000,,,,,,-0.0003000
RNTLVSGGVR,ph,T,927,false,"LAXIC - mannitol vs control",84b,23660473,XCorr,2.2300000,1.0000000,,,,0.1317559927702,
RNTLVSGGVR,ph,T,927,false,"atm and atr DNA damage response",88,25561503,"MASCOT Score",30.0000000,1.0000000,,,,,-0.0600000
RNTLVSGGVR,ph,T,927,false,"TOR Kinase and ABA Receptor",100,29290610,XCorr,3.3572013,0.9990000,,,,0.00038469998980872,
RNTLVSGGVR,ph,T,927,false,"Tissue atlas Arabidopsis - ProteomicsDB",114,32188942,"MaxQuant score",108.9100000,1.0000000,,,,0.00053495797328651,
NTLVSGGVR,ph,T,927,false,"atm and atr DNA damage response",88,25561503,"MASCOT Score",43.0000000,1.0000000,,,,,0.2700000
RNTLVSGGVR,ph,S,930,false,"Ph protein kinases and peptide chip analysis",27,18433157,,,,,,,,
RNTLVSGGVR,ph,S,930,false,"srk2dei ABA signaling phopshoproteomics",83,23572148,"MASCOT Score",39.0000000,,,,,,0.0002000
RNTLVSGGVR,ph,S,930,false,"LAXIC - mannitol vs control",84b,23660473,XCorr,2.2300000,1.0000000,,,,0.1317559927702,
RNTLVSGGVR,ph,S,930,false,"atm and atr DNA damage response",88,25561503,"MASCOT Score",30.0000000,1.0000000,,,,,-0.0600000
RNTLVSGGVR,ph,S,930,false,"TOR Kinase and ABA Receptor",100,29290610,XCorr,3.2881720,1.0000000,,,,0.011620000004768,
RNTLVSGGVR,ph,S,930,false,"Phospho cell culture sucrose/TOR",109,30833711,,,1.0000000,,,,,
RNTLVSGGVR,ph,S,930,false,"Tissue atlas Arabidopsis - ProteomicsDB",114,32188942,"MaxQuant score",143.7000000,1.0000000,,,,8.1016100011766E-5,
NTLVSGGVR,ph,S,930,false,"Pollen phosphoproteome Arabidopsis",43,22631563,"MASCOT Score",52.9300000,,,,,,-0.3115290
NTLVSGGVR,ph,S,930,false,"Large-scale phosphorylation discovery",44,23111157,XCorr,2.5800000,,,,,,
NTLVSGGVR,ph,S,930,false,"atm and atr DNA damage response",88,25561503,"MASCOT Score",48.0000000,1.0000000,,,,,1.0200000
TLVSGGVR,ph,S,930,false,"atm and atr DNA damage response",88,25561503,"MASCOT Score",28.0000000,1.0000000,,,,,0.5600000
TLVSGGVR,ph,S,930,false,"Tissue atlas Arabidopsis - ProteomicsDB",114,32188942,"MaxQuant score",85.3550000,0.9999970,,,,0.007698779925704,
