Peptide,PTM,ModifiedAA,ModifiedPosition,PeptideUniqueToGene,ExperimentDesc,ExpID,PubmedID,ScoreType,IdentScore,LocProb,Log2FChange,PQ-val,QuantSig,PEP,MassErrorPPM
CETGVWVGDRK,acy,C,134,true,"Arabidopsis S-acylation atlas - Meristem",163a,35681017,,,,,,,,
CETGVWVGDRK,acy,C,134,true,"Arabidopsis S-acylation atlas - Silique",163e,35681017,,,,,,,,
CETGVWVGDRK,acy,C,134,true,"Arabidopsis S-acylation atlas - Stem",163f,35681017,,,,,,,,
CETGVWVGDR,acy,C,134,true,"Arabidopsis S-acylation atlas - Hypocotyl",163b,35681017,,,,,,,,
CETGVWVGDR,acy,C,134,true,"Arabidopsis S-acylation atlas - Stem",163f,35681017,,,,,,,,
CETGVWVGDR,ox,C,134,true,"Redox kickstart of mitochondria",112,31871212,,,,-1.0136072,0.0000000,YES,,
CETGVWVGDR,sno,C,134,true,"hot5-4 / wildtype, FAT-switch S-nitrosoproteome",169,37277371,,,,,,,,
YFEHIVPCGIADK,ox,C,178,true,"Redox kickstart of mitochondria",112,31871212,,,,-0.8951833,0.0000003,YES,,
YFEHIVPCGIADKEVTSLR,ac,K,183,true,"Histone deacetylases- hda14 vs WT (low light)",98c,29061669,"MaxQuant Score",105.9600000,1.0000000,-0.0130000,0.9931160,NO,3.800000058618E-6,
YFEHIVPCGIADKEVTSLR,ac,K,183,true,"Histone deacetylases substrates - hda14 vs WT",98e,29061669,"MaxQuant Score",96.4000000,1.0000000,0.3010000,0.9078205,NO,9.4000002445332E-18,
