Peptide,PTM,ModifiedAA,ModifiedPosition,PeptideUniqueToGene,ExperimentDesc,ExpID,PubmedID,ScoreType,IdentScore,LocProb,Log2FChange,PQ-val,QuantSig,PEP,MassErrorPPM
AKEPVRVLVTG,nt,A,2,false,"Stromal N-terminome",96,26371235,"MASCOT Score",58.5600000,,,,,,
AKEPVRVLVTG,nt,A,2,false,"Arg/N-end rule seed, prt6 vs. Wt",99,29168982,"MASCOT Score",23.0600000,,,,,0.0034439999144524,-1.2766850
AKEPVRVLVT,nt,A,2,false,"N-term acetylation drought responses",5,26184543,,,,,,,,
AKEPVRVLVTGAAGQIGY,nta,A,2,false,"Arg/N-end rule pathway Roots",80,25728785,"MASCOT Score",54.5000000,,,,,0.041349999606609,
AKEPVRVLVTGAAGQIGY,nta,A,2,false,"Arabidopsis translation initiation landscape - NTA",167a,35069635,,,,,,,,
AKEPVRVLVTG,nta,A,2,false,"Stromal N-terminome",96,26371235,"MASCOT Score",58.5600000,,,,,,
AKEPVRVLVTG,nta,A,2,false,"Arg/N-end rule seed, prt6 vs. Wt",99,29168982,"MASCOT Score",23.0600000,,0.1399098,0.2679651,NO,0.0034439999144524,-1.2766850
AKEPVRVLVTGAAGQIGYALVPMIAR,ac,K,3,false,"Lysine acetylation gel-based Finkemeier et al",37,21311031,i-probability,1.0000000,,,,,,
GAAGQIGYALVPMIAR,nt,G,12,false,"Arabidopsis translation initiation landscape - NT",167b,35069635,,,,,,,,
GVVATTDAVE,nt,G,68,false,"Arg/N-end rule seed, prt6 vs. Wt",99,29168982,"MASCOT Score",53.6500000,,-0.4357653,0.2335312,NO,0.0023159999400377,-0.4094728
EGMERK,mox,M,97,false,"cat2 Methionine oxidation - 1h stress",62a,25693801,"MASCOT Score",31.0000000,,-0.0820215,,NO,,
KDVMSKNVSIYK,ac,K,105,false,"Quantitative Acetylproteomics",101,29440448,,,,,,,,
DVMSKNVSIYK,ac,K,105,false,"Histone deacetylases - apicidin vs control",98a,29061669,"MaxQuant Score",56.2000000,1.0000000,0.1520000,0.5382698,NO,0.003000000026077,
DVMSKNVSIYK,ac,K,105,false,"Quantitative Acetylproteomics",101,29440448,,,,,,,,
DVMSKNVSIYK,ub,K,105,false,"upl3 mutant / wildtype",168,35926874,"MaxQuant score",76.0730000,1.0000000,1.5572875,0.0842960,NO,0.00047393899876624,1.2440000
NVSIYKSQAAALEK,ac,K,111,true,"Quantitative Acetylproteomics",101,29440448,,,,,,,,
NVSIYKSQAAALEK,cr,K,111,true,"Open search Plant PTM Viewer 2.0 - Crotonylation",164c,TBA,,,,,,,,
NVSIYKSQAAALEK,hib,K,111,true,"Open search Plant PTM Viewer 2.0 - hib",164e,TBA,,,,,,,,
NVSIYKSQAAALEK,ub,K,111,true,"Ubiquitination Membrane Proteins",120,33585938,,,,,,,,
NVSIYKSQAAALEK,ub,K,111,true,"upl3 mutant / wildtype",168,35926874,"MaxQuant score",130.7200000,1.0000000,1.0648829,0.2848000,NO,5.4263701088075E-8,-0.4530200
SQAAALEKHAAPNCK,ac,K,119,true,"Histone deacetylases- hda14 vs WT (low light)",98c,29061669,"MaxQuant Score",142.3900000,1.0000000,0.0110000,0.9931160,NO,5.8999999330567E-10,
SQAAALEKHAAPNCK,ub,K,119,true,"TAP 6xHis-tag Ub",1,19292762,XCorr,3.7700000,,,,,,
SQAAALEKHAAPNCK,ub,K,119,true,"Arabidopsis ubiquitination by TUBEs",2,23667124,,,,,,,,
SQAAALEKHAAPNCK,ub,K,119,true,"Ubiquitination Membrane Proteins",120,33585938,,,,,,,,
SQAAALEKHAAPNCK,ub,K,119,true,"upl3 mutant / wildtype",168,35926874,"MaxQuant score",228.8000000,1.0000000,0.5694911,,,9.7250113424142E-43,0.8928700
HAAPNCK,sno,C,125,false,"hot5-4 / wildtype, FAT-switch S-nitrosoproteome",169,37277371,,,,0.0634658,0.7107611,NO,,
HAAPNCK,so,C,125,false,"Arabidopsis S-sulfenylation chemoproteomics",108,31578252,"pFind PSM Score",0.2251140,,0.6250000,,,,1.5491577
HAAPNCK,so,C,125,false,"S-sulfenylation site detection using YAP1C",110,32714340,,,,,,,,
VVANPANTNALILKE,nt,V,129,false,"Arg/N-end rule seed, prt6 vs. Wt",99,29168982,"MASCOT Score",50.8800000,,-0.4524336,0.3540074,NO,9.0439999239633E-12,-0.7305548
PANTNALILKE,nt,P,133,false,"Arg/N-end rule seed, prt6 vs. Wt",99,29168982,"MASCOT Score",26.7600000,,0.2196894,0.1281483,NO,0.00042530000791885,0.9027130
ALILKEFAPSIPEKNISCLTR,nt,A,138,true,"Arabidopsis translation initiation landscape - NT",167b,35069635,,,,,,,,
NISCLTR,sno,C,155,true,"Cold stress nitrosylation - 4°C vs 22°C",65,24388526,,,,,,,,
NISCLTR,sno,C,155,true,"hot5-4 / wildtype, FAT-switch S-nitrosoproteome",169,37277371,,,,,,,,
NISCLTR,so,C,155,true,"Arabidopsis S-sulfenylation chemoproteomics",108,31578252,"pFind PSM Score",0.1870570,,1.0752700,,,,0.7199910
NISCLTR,so,C,155,true,"S-sulfenylation site detection using YAP1C",110,32714340,,,,,,,,
ALGQISERLSVPVSDVK,ph,S,173,true,"Tissue atlas Arabidopsis - ProteomicsDB",114,32188942,"MaxQuant score",113.4200000,0.9774810,,,,1.4438999995647E-9,
LSVPVSDVK,ph,S,173,false,"atm and atr DNA damage response",88,25561503,"MASCOT Score",37.0000000,1.0000000,,,,,-2.0600000
LSVPVSDVK,ph,S,177,false,"SIRK1 phosphorylation",86a,23820729,"MaxQuant Score",52.7390000,0.9960000,,,,1.3650000095367,1.8520000
LSVPVSDVK,ph,S,177,false,"Tissue atlas Arabidopsis - ProteomicsDB",114,32188942,"MaxQuant score",79.8200000,0.9999970,,,,0.0047256997786462,
SSSQYPDVNHAKVQTSSGEKPVR,nt,S,189,true,"FtsH12 N-terminome: WT / FtsH12 knockdown miRNA",118,33216923,"MaxQuant score",93.0110000,,-0.4610182,0.1077558,NO,6.3099997449356E-11,
NVIIWGNHSSSQYPDVNHAK,ph,S,189,true,"Tissue atlas Arabidopsis - ProteomicsDB",114,32188942,"MaxQuant score",177.6900000,0.7531110,,,,7.5675598953133E-38,
SSQYPDVN,nt,S,190,true,"N-terminal ChaFRADIC",92,26010716,"MASCOT Score",28.2600000,,,,,0.0057310000993311,
VQTSSGEKPVR,ph,S,204,true,"Chloroplast kinase substrates",60,19376835,"MASCOT Score",34.1800000,,,,,,0.6184850
VQTSSGEKPVR,ph,S,204,true,"Lateral root-induction - NAA vs control",106,23328941,"MASCOT Score",26.0000000,,,,,,
VQTSSGEKPVR,ph,S,204,true,"Tissue atlas Arabidopsis - ProteomicsDB",114,32188942,"MaxQuant score",109.5100000,0.9751500,,,,6.4085601479746E-5,
VQTSSGEKPVR,ph,S,205,true,"Chloroplast kinase substrates",60,19376835,"MASCOT Score",37.2200000,,,,,,0.0509357
VQTSSGEKPVR,ph,S,205,true,"atm and atr DNA damage response",88,25561503,"MASCOT Score",49.0000000,0.9350000,,,,,-0.7000000
VQTSSGEKPVR,ph,S,205,true,"Phospho cell culture sucrose/TOR",109,30833711,,,0.9945870,,,,,
VQTSSGEKPVR,ph,S,205,true,"Tissue atlas Arabidopsis - ProteomicsDB",114,32188942,"MaxQuant score",133.8800000,0.9967000,,,,5.1391198212514E-6,
VQTSSGEKPVR,ac,K,208,true,"Quantitative Acetylproteomics",101,29440448,,,,,,,,
GAAIIKAR,nt,G,232,false,"Arabidopsis translation initiation landscape - NT",167b,35069635,,,,,,,,
GAAIIKAR,ac,K,237,false,"Histone deacetylases - apicidin vs control",98a,29061669,"MaxQuant Score",107.9000000,1.0000000,-0.0940000,0.5457579,NO,0.0060000000521541,
GAAIIKAR,ac,K,237,false,"Quantitative Acetylproteomics",101,29440448,,,,,,,,
GAAIIKAR,ub,K,237,false,"Arabidopsis ubiquitination COFRADIC",40,26744219,"MaxQuant Score",94.2620000,1.0000000,,,,0.01799999922514,0.2920000
GAAIIKAR,ub,K,237,false,"Ubiquitination Membrane Proteins",120,33585938,,,,,,,,
GAAIIKAR,ub,K,237,false,"upl3 mutant / wildtype",168,35926874,"MaxQuant score",110.6300000,1.0000000,-0.0664274,0.9350400,NO,0.0070844301953912,-0.7557000
KLSSALSAASSACDHIR,ub,K,240,false,"upl3 mutant / wildtype",168,35926874,"MaxQuant score",132.5100000,1.0000000,0.2821432,0.7145400,NO,2.24478009965E-12,-0.4621300
KLSSALSAASSACDHIR,ph,S,242,false,"Phosphoproteome iron-deficient Arabidopsis roots",41,22438062,"MASCOT Score",64.5500000,,,,,,
KLSSALSAASSACDHIR,ph,S,242,false,"PAMP-triggered phosphorylation",48,24601666,"MASCOT Score",55.8300000,,,,,,
KLSSALSAASSACDHIR,ph,S,242,false,"Tyrosine phosphorylation in Arabidopsis",59,18463617,"MASCOT Score",36.0000000,,,,,,-1.8889853
KLSSALSAASSACDHIR,ph,S,242,false,"Tissue atlas Arabidopsis - ProteomicsDB",114,32188942,"MaxQuant score",121.3300000,0.9873520,,,,3.8759301324021E-10,
LSSALSAASSACDHIR,ph,S,242,false,"Phospho cell culture sucrose/TOR",109,30833711,,,0.9063460,,,,,
SALSAASSACDHIR,nt,S,243,false,"Arg/N-end rule seed, prt6 vs. Wt",99,29168982,"MASCOT Score",83.6800000,,-0.7556462,0.1097786,NO,0.001589999999851,-1.2961021
SALSAASSACDHIR,nt,S,243,false,"Arabidopsis translation initiation landscape - NT",167b,35069635,,,,,,,,
LSSALSAASSACDHIR,ph,S,243,false,"Phospho cell culture sucrose/TOR",109,30833711,,,0.8922020,,,,,
LSSALSAASSACDHIR,ph,S,243,false,"Tissue atlas Arabidopsis - ProteomicsDB",114,32188942,"MaxQuant score",176.2900000,0.9995790,,,,6.4393897499282E-20,
LSSALSAASSACDHIR,ph,S,246,false,"Phosphoproteome iron-deficient Arabidopsis roots",41,22438062,"MASCOT Score",36.6700000,,,,,,
LSSALSAASSACDHIR,ph,S,246,false,"Phospho cell culture sucrose/TOR",109,30833711,,,0.9994470,,,,,
LSSALSAASSACDHIR,ph,S,246,false,"Tissue atlas Arabidopsis - ProteomicsDB",114,32188942,"MaxQuant score",261.6400000,1.0000000,,,,0,
LSSALSAASSACDHIR,sno,C,252,false,"Site-specific nitrosomeproteomic id - gsnor1-3",90a,25699590,XCorr,3.6828659,,,,,5.4580000323767E-6,-5.3611310
LSSALSAASSACDHIR,sno,C,252,false,"hot5-4 / wildtype, FAT-switch S-nitrosoproteome",169,37277371,,,,,,,,
LSSALSAASSACDHIR,so,C,252,false,"Arabidopsis S-sulfenylation chemoproteomics",108,31578252,"pFind PSM Score",0.0000045,,1.3583400,,,,-0.3020480
LSSALSAASSACDHIR,so,C,252,false,"S-sulfenylation site detection using YAP1C",110,32714340,,,,,,,,
KMDLTAEELKEEK,cr,K,312,false,"Open search Plant PTM Viewer 2.0 - Crotonylation",164c,TBA,,,,,,,,
KMDLTAEELK,mox,M,313,false,"cat2 Methionine oxidation - 1h stress",62a,25693801,"MASCOT Score",80.0000000,,1.1961297,,NO,,
MDLTAEELKEEKDLAYSCLS,so,C,330,false,"S-sulfenylation site detection using YAP1C",110,32714340,,,,,,,,
DLAYSCLS,ph,S,332,false,"atm and atr DNA damage response",88,25561503,"MASCOT Score",34.0000000,1.0000000,,,,,-0.0500000
DLAYSCLS,ph,S,332,false,"Tissue atlas Arabidopsis - ProteomicsDB",114,32188942,"MaxQuant score",149.7200000,1.0000000,,,,0.014964999631047,
