Peptide,PTM,ModifiedAA,ModifiedPosition,PeptideUniqueToGene,ExperimentDesc,ExpID,PubmedID,ScoreType,IdentScore,LocProb,Log2FChange,PQ-val,QuantSig,PEP,MassErrorPPM
AEAVDEDSGVGR,nta,A,2,true,"Characterization plant N-terminal acetylation",6,22223895,"MASCOT Score",54.4400000,,,,,,
AEAVDEDSGVGR,nta,A,2,true,"Arabidopsis translation initiation landscape - NTA",167a,35069635,,,,,,,,
DLEENQNQNQNDEEEKDSVTEK,ph,S,495,true,"Tissue atlas Arabidopsis - ProteomicsDB",114,32188942,"MaxQuant score",180.7100000,0.9417400,,,,0,
GISISTPNGITEGK,ph,T,566,true,"Tissue atlas Arabidopsis - ProteomicsDB",114,32188942,"MaxQuant score",158.4700000,0.9993880,,,,4.8324100276886E-10,
SGVTNGSYQGNSLNFR,ph,S,604,true,"Tissue atlas Arabidopsis - ProteomicsDB",114,32188942,"MaxQuant score",191.3600000,1.0000000,,,,1.7515699521366E-35,
KTVQSIVNSVDMDRPK,ph,S,693,true,"Tissue atlas Arabidopsis - ProteomicsDB",114,32188942,"MaxQuant score",51.7770000,0.9939130,,,,0.0013223600108176,
STAVLSSPR,ph,S,708,true,"Large-scale phosphorylation discovery",44,23111157,XCorr,3.3340000,,,,,,
STAVLSSPR,ph,S,708,true,"TOR Kinase and ABA Receptor",100,29290610,XCorr,3.0923855,0.9355000,,,,6.0049998864997E-5,
STAVLSSPR,ph,S,708,true,"Lateral root-induction - NAA vs control",106,23328941,"MASCOT Score",36.0000000,,,,,,
STAVLSSPR,ph,S,708,true,"Tissue atlas Arabidopsis - ProteomicsDB",114,32188942,"MaxQuant score",145.4600000,0.8459240,,,,0.0001121309978771,
STAVLSSPR,ph,S,709,true,"Large-scale phosphorylation discovery",44,23111157,XCorr,2.3320000,,,,,,
STAVLSSPR,ph,S,709,true,"atm and atr DNA damage response",88,25561503,"MASCOT Score",42.0000000,0.9970000,,,,,-1.0400000
STAVLSSPR,ph,S,709,true,"Lateral root-induction - NAA vs control",106,23328941,"MASCOT Score",34.0000000,,,,,,
STAVLSSPR,ph,S,709,true,"Tissue atlas Arabidopsis - ProteomicsDB",114,32188942,"MaxQuant score",163.1200000,0.9725540,,,,6.2026001614868E-6,
SISTADGIPNRK,ph,S,729,true,"Tissue atlas Arabidopsis - ProteomicsDB",114,32188942,"MaxQuant score",132.6900000,0.9990750,,,,2.4487100745318E-5,
LGPDPSLHNQQTYTPQSYK,ph,T,835,true,"Tissue atlas Arabidopsis - ProteomicsDB",114,32188942,"MaxQuant score",109.2300000,0.9323430,,,,2.160580048205E-10,
SPSSVNMGMYNNTYSPAVTSNR,ph,S,899,true,"Tissue atlas Arabidopsis - ProteomicsDB",114,32188942,"MaxQuant score",121.0000000,0.7879370,,,,1.6725100241488E-21,
SPSSVNMGMYNNTYSPAVTSNR,ph,S,901,true,"Tissue atlas Arabidopsis - ProteomicsDB",114,32188942,"MaxQuant score",119.6200000,0.8071430,,,,1.9150200532883E-21,
TRSFGEEGLHYMAR,ph,T,991,true,"TOR Kinase and ABA Receptor",100,29290610,XCorr,4.3453875,0.9376000,,,,2.1319999632397E-6,
TRSFGEEGLHYMAR,ph,S,993,true,"atm and atr DNA damage response",88,25561503,"MASCOT Score",57.0000000,1.0000000,,,,,-0.3600000
TRSFGEEGLHYMAR,ph,S,993,true,"TOR Kinase and ABA Receptor",100,29290610,XCorr,2.4830003,0.8803000,,,,0.064489997923374,
SFGEEGLHYMAR,ph,S,993,true,"atm and atr DNA damage response",88,25561503,"MASCOT Score",24.0000000,1.0000000,,,,,-0.1000000
SFGEEGLHYMAR,ph,S,993,true,"Tissue atlas Arabidopsis - ProteomicsDB",114,32188942,"MaxQuant score",210.1500000,1.0000000,,,,3.2871900184587E-31,
