Peptide,PTM,ModifiedAA,ModifiedPosition,PeptideUniqueToGene,ExperimentDesc,ExpID,PubmedID,ScoreType,IdentScore,LocProb,Log2FChange,PQ-val,QuantSig,PEP,MassErrorPPM
GDSEAMVSEG,nt,G,2,true,"N-term acetylation drought responses",5,26184543,,,,,,,,
GDSEAMVSEGYTSAPYGDYN,nta,G,2,true,"HUNTER N-terminome: legumain, GluC and trypsin",119,31951383,"MaxQuant score",115.2400000,,,,,,
GDSEAMVSEG,nta,G,2,true,"N-term acetylation drought responses",5,26184543,,,,,,,,
ANSLEFNAWTALIDETER,ph,S,97,true,"SnRK2 protein kinase substrates",85,23776212,XCorr,3.5141494,1.0000000,,,,8.8631197286304E-5,
SAEESAAAAVAVAGDASESAASESGEK,ph,S,284,true,"TOR Kinase and ABA Receptor",100,29290610,XCorr,3.7175353,0.9527000,,,,1.0679999832064E-5,
SAEESAAAAVAVAGDASESAASESGEKADEGR,ph,S,286,true,"Tissue atlas Arabidopsis - ProteomicsDB",114,32188942,"MaxQuant score",198.1000000,0.7945760,,,,0,
SAEESAAAAVAVAGDASESAASESGEK,ph,S,286,true,"srk2dei ABA signaling phopshoproteomics",83,23572148,"MASCOT Score",27.0000000,,,,,,-0.0019000
SQVDGSTEQSPKLESASSTEPEELKK,ph,S,295,true,"Tissue atlas Arabidopsis - ProteomicsDB",114,32188942,"MaxQuant score",57.0880000,0.9963500,,,,0.00044328699004836,
SQVDGSTEQSPKLESASSTEPEELK,ph,S,295,true,"srk2dei ABA signaling phopshoproteomics",83,23572148,"MASCOT Score",46.0000000,,,,,,-0.0045000
ADEGRSQVDGSTEQSPK,ph,S,295,true,"atm and atr DNA damage response",88,25561503,"MASCOT Score",31.0000000,1.0000000,,,,,-2.5900000
SQVDGSTEQSPK,ph,S,295,true,"atm and atr DNA damage response",88,25561503,"MASCOT Score",33.0000000,1.0000000,,,,,-2.6600000
SQVDGSTEQSPKLESASSTEPEELKK,ph,S,300,true,"Large-scale phosphorylation discovery",44,23111157,XCorr,4.7200000,,,,,,
SQVDGSTEQSPKLESASSTEPEELKK,ph,S,300,true,"Phosphoproteome ethylene-regulated time response",46,24043427,"MASCOT Score",39.5500000,,,,,,-7.3485000
SQVDGSTEQSPKLESASSTEPEELKK,ph,S,300,true,"Tissue atlas Arabidopsis - ProteomicsDB",114,32188942,"MaxQuant score",138.8400000,0.9804440,,,,1.8146815113006E-42,
SQVDGSTEQSPKLESASSTEPEELKK,ph,T,301,true,"Arabidopsis root NAA phosphoproteome",18a,27643528,"MaxQuant Score",111.1800000,0.7650000,,,,3.5260000496629E-18,0.1510000
SQVDGSTEQSPKLESASSTEPEELKK,ph,T,301,true,"Large-scale phosphorylation discovery",44,23111157,XCorr,3.9760000,,,,,,
SQVDGSTEQSPKLESASSTEPEELKK,ph,T,301,true,"Tissue atlas Arabidopsis - ProteomicsDB",114,32188942,"MaxQuant score",133.1500000,0.7914780,,,,3.6531850964948E-42,
SQVDGSTEQSPKLESASSTEPEELK,ph,T,301,true,"srk2dei ABA signaling phopshoproteomics",83,23572148,"MASCOT Score",66.0000000,,,,,,0.0006000
SQVDGSTEQSPK,ph,T,301,true,"Lateral root-induction - NAA vs control",106,23328941,"MASCOT Score",22.0000000,,,,,,
SQVDGSTEQSPKLESASSTEPEELKK,ph,S,304,true,"Arabidopsis root NAA phosphoproteome",18a,27643528,"MaxQuant Score",83.9920000,0.7750000,,,,1.1970000102224E-8,-0.1880000
SQVDGSTEQSPKLESASSTEPEELKK,ph,S,304,true,"STN8 phosphoproteome",38,21768351,"MASCOT Score",46.7300000,,,,,,-1.1338500
SQVDGSTEQSPKLESASSTEPEELKK,ph,S,304,true,"Phosphoproteome ethylene-regulated time response",46,24043427,"MASCOT Score",102.5000000,,,,,,-3.7303000
SQVDGSTEQSPKLESASSTEPEELKK,ph,S,304,true,"PAMP-triggered phosphorylation",48,24601666,"MASCOT Score",51.1700000,,,,,,
SQVDGSTEQSPKLESASSTEPEELKK,ph,S,304,true,"Conserved plant phosphoproteome - Arabidopsis",61a,20466843,"MASCOT Score",79.0000000,1.0000000,,,,,
SQVDGSTEQSPKLESASSTEPEELKK,ph,S,304,true,"srk2dei ABA signaling phopshoproteomics",83,23572148,"MASCOT Score",80.0000000,,,,,,-0.0002000
SQVDGSTEQSPKLESASSTEPEELKK,ph,S,304,true,"LAXIC - mannitol vs control",84b,23660473,XCorr,4.6300000,0.8870000,,,,4.799999915768E-13,
SQVDGSTEQSPKLESASSTEPEELKK,ph,S,304,true,"SnRK2 protein kinase substrates",85,23776212,XCorr,4.6729746,0.9930000,,,,0.00035432798904367,
SQVDGSTEQSPKLESASSTEPEELKK,ph,S,304,true,"atm and atr DNA damage response",88,25561503,"MASCOT Score",33.0000000,0.9890000,,,,,-0.6000000
SQVDGSTEQSPKLESASSTEPEELKK,ph,S,304,true,"TOR Kinase and ABA Receptor",100,29290610,XCorr,5.2976093,0.8697000,,,,1.3640000361193E-5,
SQVDGSTEQSPKLESASSTEPEELK,ph,S,304,true,"srk2dei ABA signaling phopshoproteomics",83,23572148,"MASCOT Score",71.0000000,,,,,,-0.0010000
SQVDGSTEQSPKLESASSTEPEELK,ph,S,304,true,"TOR Kinase and ABA Receptor",100,29290610,XCorr,5.2192631,0.8361000,,,,4.7650000851718E-6,
SQVDGSTEQSPKLESASSTEPEELK,ph,S,304,true,"Phospho cell culture sucrose/TOR",109,30833711,,,0.9947490,,,,,
SQVDGSTEQSPK,ph,S,304,true,"Phosphorylation RNA metabolism",22,16807317,,,,,,,,
SQVDGSTEQSPK,ph,S,304,true,"STN8 phosphoproteome",38,21768351,"MASCOT Score",63.5700000,,,,,,-0.7527630
SQVDGSTEQSPK,ph,S,304,true,"LAXIC - ABA stress",84a,23660473,XCorr,3.4300000,1.0000000,,,,0.066457703709602,
SQVDGSTEQSPK,ph,S,304,true,"LAXIC - mannitol vs control",84b,23660473,XCorr,2.6700000,1.0000000,,,,0.0045442897826433,
SQVDGSTEQSPK,ph,S,304,true,"SnRK2 protein kinase substrates",85,23776212,XCorr,3.1074793,1.0000000,,,,0.00051187101053074,
SQVDGSTEQSPK,ph,S,304,true,"atm and atr DNA damage response",88,25561503,"MASCOT Score",58.0000000,0.9990000,,,,,0.0700000
SQVDGSTEQSPK,ph,S,304,true,"Protein sumoylation and phosphorylation cross-talk",97,28419593,,,,,,,,
SQVDGSTEQSPK,ph,S,304,true,"TOR Kinase and ABA Receptor",100,29290610,XCorr,3.6858001,1.0000000,,,,0.00023109999892768,
SQVDGSTEQSPK,ph,S,304,true,"Lateral root-induction - NAA vs control",106,23328941,"MASCOT Score",46.0000000,,-0.1230436,0.5077795,NO,,
SQVDGSTEQSPK,ph,S,304,true,"Tissue atlas Arabidopsis - ProteomicsDB",114,32188942,"MaxQuant score",282.5300000,1.0000000,,,,0,
SQVDGSTEQSPKLESASSTEPEELKK,ph,S,309,true,"PAMP-triggered phosphorylation",48,24601666,"MASCOT Score",62.3400000,,,,,,
SQVDGSTEQSPKLESASSTEPEELKK,ph,S,309,true,"srk2dei ABA signaling phopshoproteomics",83,23572148,"MASCOT Score",48.0000000,,,,,,0.0007000
SQVDGSTEQSPKLESASSTEPEELK,ph,S,311,true,"srk2dei ABA signaling phopshoproteomics",83,23572148,"MASCOT Score",42.0000000,,,,,,-0.0001000
QNGDIAGARAAYQLVHSE,nt,Q,442,true,"HUNTER N-terminome: legumain, GluC and trypsin",119,31951383,"MaxQuant score",,,,,,,
STSELKKR,nt,S,621,true,"Arabidopsis translation initiation landscape - NT",167b,35069635,,,,,,,,
KRSADDFLASDR,ph,S,629,true,"srk2dei ABA signaling phopshoproteomics",83,23572148,"MASCOT Score",21.0000000,,,,,,-0.0010000
KRSADDFLASDR,ph,S,629,true,"TOR Kinase and ABA Receptor",100,29290610,XCorr,4.4072194,1.0000000,,,,1.6269999605356E-6,
SADDFLASDR,ph,S,629,true,"atm and atr DNA damage response",88,25561503,"MASCOT Score",51.0000000,1.0000000,,,,,0.0100000
SADDFLASDR,ph,S,629,true,"Tissue atlas Arabidopsis - ProteomicsDB",114,32188942,"MaxQuant score",140.7800000,1.0000000,,,,4.2208098420815E-6,
SADDFLASDR,ph,S,636,true,"Tissue atlas Arabidopsis - ProteomicsDB",114,32188942,"MaxQuant score",88.0920000,1.0000000,,,,0.0009234810131602,
