Peptide,PTM,ModifiedAA,ModifiedPosition,PeptideUniqueToGene,ExperimentDesc,ExpID,PubmedID,ScoreType,IdentScore,LocProb,Log2FChange,PQ-val,QuantSig,PEP,MassErrorPPM
LMSSSNSDLSRR,ph,S,9,true,"Tissue atlas Arabidopsis - ProteomicsDB",114,32188942,"MaxQuant score",59.5700000,0.9683030,,,,0.005569770000875,
LMSSSNSDLSR,ph,S,9,true,"atm and atr DNA damage response",88,25561503,"MASCOT Score",30.0000000,0.8650000,,,,,3.0900000
LMSSSNSDLSR,ph,S,12,true,"Tissue atlas Arabidopsis - ProteomicsDB",114,32188942,"MaxQuant score",153.8100000,0.9804740,,,,1.7024299747703E-9,
RNSSSASSSPSIR,ph,S,19,true,"Tissue atlas Arabidopsis - ProteomicsDB",114,32188942,"MaxQuant score",76.3910000,0.9954960,,,,0.0010432100389153,
AEMDEGASDEIDVK,ph,S,129,true,"atm and atr DNA damage response",88,25561503,"MASCOT Score",62.0000000,1.0000000,,,,,-0.5900000
AEMDEGASDEIDVK,ph,S,129,true,"Tissue atlas Arabidopsis - ProteomicsDB",114,32188942,"MaxQuant score",258.9600000,1.0000000,,,,0,
LNNDGSYTFDFPMQR,ph,S,146,true,"Tissue atlas Arabidopsis - ProteomicsDB",114,32188942,"MaxQuant score",179.9000000,0.9998410,,,,5.2876498451491E-25,
HSSFQMVEGSMGGGVTR,ph,S,158,true,"Tissue atlas Arabidopsis - ProteomicsDB",114,32188942,"MaxQuant score",126.4000000,0.9946640,,,,3.0535199369019E-10,
