Peptide,PTM,ModifiedAA,ModifiedPosition,PeptideUniqueToGene,ExperimentDesc,ExpID,PubmedID,ScoreType,IdentScore,LocProb,Log2FChange,PQ-val,QuantSig,PEP,MassErrorPPM
EAPFPNAC,nt,E,29,true,"Arg/N-end rule seed, prt6 vs. Wt",99,29168982,"MASCOT Score",43.0000000,,2.8898989,0.0074556,YES,0.12559999525547,-0.4883344
APFPNACHFSQ,nt,A,30,true,"Arg/N-end rule seed, prt6 vs. Wt",99,29168982,"MASCOT Score",32.6800000,,4.3353899,0.0060279,YES,0.0059830001555383,-1.9408322
APFPNACHFS,nt,A,30,true,"Arg/N-end rule seed, prt6 vs. Wt",99,29168982,"MASCOT Score",35.2500000,,3.2618751,0.0089984,YES,0.015639999881387,-1.6880010
APFPNACH,nt,A,30,true,"Arg/N-end rule seed, prt6 vs. Wt",99,29168982,"MASCOT Score",32.7600000,,2.0029558,0.0005105,YES,0.025569999590516,-0.8707605
EAPFPNACHFSQINSLAPAQATK,sno,C,36,true,"hot5-4 / wildtype, FAT-switch S-nitrosoproteome",169,37277371,,,,1.9995136,0.0327422,YES,,
SLAPAQATKFE,nt,S,43,true,"Arg/N-end rule seed, prt6 vs. Wt",99,29168982,"MASCOT Score",35.6800000,,1.4091805,0.0003110,YES,6.2459997707265E-7,0.7944891
CAGVTVAR,sno,C,69,true,"hot5-4 / wildtype, FAT-switch S-nitrosoproteome",169,37277371,,,,,,,,
PETFAEVEGSSGR,nt,P,113,true,"Arg/N-end rule seed, prt6 vs. Wt",99,29168982,"MASCOT Score",47.5600000,,2.1713153,0.0132008,YES,0.0092669995501637,-0.5693632
QLQNQKDNR,nt,Q,235,true,"Metacaspase9 substrates - in vitro rMC9",51c,23964026,"MASCOT Score",55.0000000,,,,,,0.7016657
GIEETYCTAKIHENIDDPER,nt,G,271,true,"Arg/N-end rule seed, prt6 vs. Wt",99,29168982,"MASCOT Score",23.1400000,,2.7504052,0.0161361,YES,0.00016120000509545,-3.5125286
GIEETYCTAKIHENIDDPER,nta,G,271,true,"FtsH12 N-terminome: WT / FtsH12 knockdown miRNA",118,33216923,"MaxQuant score",108.4700000,,,,,1.8100000431787E-7,
