Peptide,PTM,ModifiedAA,ModifiedPosition,PeptideUniqueToGene,ExperimentDesc,ExpID,PubmedID,ScoreType,IdentScore,LocProb,Log2FChange,PQ-val,QuantSig,PEP,MassErrorPPM
EAQDTATGIPVVNDSTWD,nt,E,68,true,"HUNTER N-terminome: legumain, GluC and trypsin",119,31951383,"MaxQuant score",175.6200000,,,,,,
EAQDTATGIPVVND,nt,E,68,true,"HUNTER N-terminome: legumain, GluC and trypsin",119,31951383,"MaxQuant score",163.5100000,,,,,,
EAQDTATGIPVVN,nt,E,68,true,"HUNTER N-terminome: legumain, GluC and trypsin",119,31951383,"MaxQuant score",129.8200000,,,,,,
AQDTATGIPVVNDSTWD,nt,A,69,true,"HUNTER N-terminome: legumain, GluC and trypsin",119,31951383,"MaxQuant score",88.0920000,,,,,,
AQDTATGIPVVND,nt,A,69,true,"Arg/N-end rule seed, prt6 vs. Wt",99,29168982,"MASCOT Score",51.4300000,,-0.2460033,0.5038478,NO,9.5900004453142E-6,-0.6268424
QDTATGIPVVN,nt,Q,70,true,"N-terminal ChaFRADIC",92,26010716,"MASCOT Score",60.2600000,,,,,1.7950000597011E-7,
MIDPIVNELAQK,mox,M,109,true,"cat2 Methionine oxidation - 1h stress",62a,25693801,"MASCOT Score",56.0000000,,0.0957368,,NO,,
MIDPIVNELAQK,mox,M,109,true,"cat2 Methionine oxidation - 3h stress",62b,25693801,"MASCOT Score",82.0000000,,-0.0197840,,NO,,
YAGQFKFYK,ac,K,126,true,"Quantitative Acetylproteomics",101,29440448,,,,,,,,
DTIIGAVSKDTLATSINK,ph,S,167,true,"Tissue atlas Arabidopsis - ProteomicsDB",114,32188942,"MaxQuant score",170.3800000,0.9994620,,,,2.5077799584199E-27,
DTIIGAVSKDTLATSINK,ac,K,168,true,"Histone deacetylases substrates - hda14 vs WT",98e,29061669,"MaxQuant Score",50.2000000,1.0000000,-0.1410000,0.9099133,NO,0.00044000000343658,
