Peptide,PTM,ModifiedAA,ModifiedPosition,PeptideUniqueToGene,ExperimentDesc,ExpID,PubmedID,ScoreType,IdentScore,LocProb,Log2FChange,PQ-val,QuantSig,PEP,MassErrorPPM
AEDEEYIKDTSAVISKVR,nt,A,69,true,"N-terminal ChaFRADIC",92,26010716,"MASCOT Score",20.4900000,,,,,8.0089996856714E-8,
AEDEEYIKDTSAVISKVR,nt,A,69,true,"Stromal N-terminome",96,26371235,"MASCOT Score",65.1500000,,,,,,
AEDEEYIKDTSAVISKVR,nt,A,69,true,"FtsH12 N-terminome: WT / FtsH12 knockdown miRNA",118,33216923,"MaxQuant score",78.4010000,,,,,0.0010311000514776,
AEDEEYIKDTSAVISKVR,nt,A,69,true,"HUNTER N-terminome: legumain, GluC and trypsin",119,31951383,"MaxQuant score",69.7370000,,,,,,
AEDEEYIKD,nt,A,69,true,"N-terminal ChaFRADIC",92,26010716,"MASCOT Score",33.9300000,,,,,0.00020070000027772,
AEDEEYIK,nt,A,69,true,"N-terminal ChaFRADIC",92,26010716,"MASCOT Score",53.2900000,,,,,3.0809999316261E-6,
DTSAVISKVR,ac,K,84,true,"Quantitative Acetylproteomics",101,29440448,,,,,,,,
VRSTLSMQK,ph,S,87,true,"atm and atr DNA damage response",88,25561503,"MASCOT Score",37.0000000,0.9640000,,,,,0.2600000
VRSTLSMQK,ph,S,87,true,"Tissue atlas Arabidopsis - ProteomicsDB",114,32188942,"MaxQuant score",79.4920000,0.8977490,,,,0.0078390100970864,
VRSTLSMQK,ph,T,88,true,"atm and atr DNA damage response",88,25561503,"MASCOT Score",25.0000000,0.9300000,,,,,-1.2700000
VRSTLSMQK,mox,M,91,true,"cat2 Methionine oxidation - 1h stress",62a,25693801,"MASCOT Score",60.0000000,,0.0632434,,NO,,
EASNSWVAKYR,ac,K,115,true,"Quantitative Acetylproteomics",101,29440448,,,,,,,,
ARILEEMETAEK,mox,M,163,true,"cat2 Methionine oxidation - 1h stress",62a,25693801,"MASCOT Score",64.0000000,,0.0706771,,NO,,
ARILEEMETAEK,mox,M,163,true,"cat2 Methionine oxidation - 3h stress",62b,25693801,"MASCOT Score",69.0000000,,-0.0105161,,NO,,
ILEEMETAEKALTR,ub,K,168,true,"Arabidopsis ubiquitination COFRADIC",40,26744219,"MaxQuant Score",83.6920000,1.0000000,,,,1.9859999156324E-5,-0.6260000
