Peptide,PTM,ModifiedAA,ModifiedPosition,PeptideUniqueToGene,ExperimentDesc,ExpID,PubmedID,ScoreType,IdentScore,LocProb,Log2FChange,PQ-val,QuantSig,PEP,MassErrorPPM
GGCISK,myr,G,2,true,"N-Terminal Myristoylated Proteins",102,29453228,,,,,,,,
MVSLHNLVSIPNR,ph,S,41,true,"atm and atr DNA damage response",88,25561503,"MASCOT Score",40.0000000,1.0000000,,,,,-0.7700000
MVSLHNLVSIPNR,ph,S,41,true,"TOR Kinase and ABA Receptor",100,29290610,XCorr,3.5941939,1.0000000,,,,0.00024280000070576,
MVSLHNLVSIPNR,ph,S,41,true,"Tissue atlas Arabidopsis - ProteomicsDB",114,32188942,"MaxQuant score",199.0400000,1.0000000,,,,6.8559400861992E-31,
LLSLLNSIKSK,ph,S,125,true,"Tissue atlas Arabidopsis - ProteomicsDB",114,32188942,"MaxQuant score",98.6760000,0.9163230,,,,2.4527700588806E-5,
SLSTDQENNSYGK,ph,S,407,true,"atm and atr DNA damage response",88,25561503,"MASCOT Score",24.0000000,0.9260000,,,,,-0.4600000
SLSTDQENNSYGK,ph,S,407,true,"Tissue atlas Arabidopsis - ProteomicsDB",114,32188942,"MaxQuant score",283.1300000,0.9998730,,,,0,
SLSTDQENNSYGK,ph,S,414,true,"Tissue atlas Arabidopsis - ProteomicsDB",114,32188942,"MaxQuant score",225.8600000,1.0000000,,,,0,
EGEQNWSGLEGVTR,ph,T,444,true,"Tissue atlas Arabidopsis - ProteomicsDB",114,32188942,"MaxQuant score",213.0000000,1.0000000,,,,2.4522723125684E-43,
VNSLVQLPR,ph,S,448,false,"Arabidopsis root NAA phosphoproteome",18a,27643528,"MaxQuant Score",62.4660000,1.0000000,,,,0.00028199999360368,-0.1770000
VNSLVQLPR,ph,S,448,false,"Plasmembrane Ph Immune Responses",25,17651370,,,,,,,,
VNSLVQLPR,ph,S,448,false,"Phosphoproteome ethylene-regulated time response",46,24043427,"MASCOT Score",70.4700000,,,,,,-5.3400000
VNSLVQLPR,ph,S,448,false,"srk2dei ABA signaling phopshoproteomics",83,23572148,"MASCOT Score",51.0000000,,,,,,0.0004000
VNSLVQLPR,ph,S,448,false,"LAXIC - ABA stress",84a,23660473,XCorr,2.2900000,1.0000000,,,,0.01590790040791,
VNSLVQLPR,ph,S,448,false,"atm and atr DNA damage response",88,25561503,"MASCOT Score",67.0000000,1.0000000,,,,,0.0900000
VNSLVQLPR,ph,S,448,false,"TOR Kinase and ABA Receptor",100,29290610,XCorr,3.6928413,1.0000000,,,,9.1640004029614E-6,
VNSLVQLPR,ph,S,448,false,"Lateral root-induction - NAA vs control",106,23328941,"MASCOT Score",36.0000000,,,,,,
VNSLVQLPR,ph,S,448,false,"Phospho cell culture sucrose/TOR",109,30833711,,,1.0000000,,,,,
VNSLVQLPR,ph,S,448,false,"Col-0 callus - FC Col-0 vs. Col-0 Xray",111a,31410901,,65.7000000,,2.0160417,0.0000000,NO,,0.1305155
VNSLVQLPR,ph,S,448,false,"Col-0 X-ray callus - FC Col-0 vs. Col-0 Xray",111b,31410901,,65.7000000,,2.0160417,0.0000000,NO,,0.1305155
VNSLVQLPR,ph,S,448,false,"atm callus - FC atm vs. atm Xray",111c,31410901,,65.7000000,,0.8970235,0.0000000,NO,,0.1305155
VNSLVQLPR,ph,S,448,false,"atm-3 X-ray callus - FC atm vs. atm Xray",111d,31410901,,65.7000000,,0.8970235,0.0000000,NO,,0.1305155
VNSLVQLPR,ph,S,448,false,"Tissue atlas Arabidopsis - ProteomicsDB",114,32188942,"MaxQuant score",252.5100000,1.0000000,,,,0,
VNSLVQLPR,ph,S,448,false,"Touch-induced phosphorylation: 40s touch vs untouc",136,30291188,"MASCOT score",85.1700000,,0.4365401,0.0012782,YES,,3.3867170
