Peptide,PTM,ModifiedAA,ModifiedPosition,PeptideUniqueToGene,ExperimentDesc,ExpID,PubmedID,ScoreType,IdentScore,LocProb,Log2FChange,PQ-val,QuantSig,PEP,MassErrorPPM
TDEGLACSIEVGLEK,ph,S,217,true,"Tissue atlas Arabidopsis - ProteomicsDB",114,32188942,"MaxQuant score",113.6100000,1.0000000,,,,1.6476600649185E-5,
VSLAVDDDEKSDEAK,ph,S,235,true,"STN8 phosphoproteome",38,21768351,"MASCOT Score",95.0500000,,,,,,-0.9234010
VSLAVDDDEKSDEAK,ph,S,235,true,"Phosphoproteome iron-deficient Arabidopsis roots",41,22438062,"MASCOT Score",52.2300000,,,,,,
VSLAVDDDEKSDEAK,ph,S,235,true,"Tyrosine phosphorylation in Arabidopsis",59,18463617,"MASCOT Score",70.0000000,,,,,,-0.5294996
VSLAVDDDEKSDEAK,ph,S,235,true,"Chloroplast kinase substrates",60,19376835,"MASCOT Score",80.8100000,,,,,,-2.2279500
VSLAVDDDEKSDEAK,ph,S,235,true,"Conserved plant phosphoproteome - Arabidopsis",61a,20466843,"MASCOT Score",92.0000000,1.0000000,,,,,
VSLAVDDDEKSDEAK,ph,S,235,true,"SnRK2 protein kinase substrates",85,23776212,XCorr,4.5031118,1.0000000,,,,1.3400099696526E-8,
VSLAVDDDEKSDEAK,ph,S,235,true,"TOR Kinase and ABA Receptor",100,29290610,XCorr,5.2554483,1.0000000,,,,4.1290000808658E-5,
VSLAVDDDEKSDEAK,ph,S,235,true,"Phospho cell culture sucrose/TOR",109,30833711,,,1.0000000,,,,,
VSLAVDDDEKSDEAK,ph,S,235,true,"Tissue atlas Arabidopsis - ProteomicsDB",114,32188942,"MaxQuant score",364.1400000,1.0000000,,,,0,
KGYDASGDNDEEIPDELEFSDDEKEAEYRR,ph,S,494,true,"Arabidopsis root NAA phosphoproteome",18a,27643528,"MaxQuant Score",88.0870000,1.0000000,,,,5.1979998083596E-10,0.4940000
KGYDASGDNDEEIPDELEFSDDEKEAEYR,ph,S,494,true,"SnRK2 protein kinase substrates",85,23776212,XCorr,4.6908884,1.0000000,,,,8.2923702626747E-11,
GYDASGDNDEEIPDELEFSDDEKEAEYR,ph,S,494,true,"Col-0 callus - FC Col-0 vs. Col-0 Xray",111a,31410901,,35.9700000,,0.8467231,0.0288423,YES,,-0.6933307
GYDASGDNDEEIPDELEFSDDEKEAEYR,ph,S,494,true,"Col-0 X-ray callus - FC Col-0 vs. Col-0 Xray",111b,31410901,,35.9700000,,0.8467231,0.0288423,YES,,-0.6933307
GYDASGDNDEEIPDELEFSDDEKEAEYR,ph,S,494,true,"atm callus - FC atm vs. atm Xray",111c,31410901,,35.9700000,,3.9073630,0.0594414,NO,,-0.6933307
GYDASGDNDEEIPDELEFSDDEKEAEYR,ph,S,494,true,"atm-3 X-ray callus - FC atm vs. atm Xray",111d,31410901,,35.9700000,,3.9073630,0.0594414,NO,,-0.6933307
KGYDASGDNDEEIPDELEFSDDEK,ph,S,494,true,"STN8 phosphoproteome",38,21768351,"MASCOT Score",68.8300000,,,,,,-1.2943100
KGYDASGDNDEEIPDELEFSDDEK,ph,S,494,true,"Chloroplast kinase substrates",60,19376835,"MASCOT Score",68.6300000,,,,,,-1.2943100
KGYDASGDNDEEIPDELEFSDDEK,ph,S,494,true,"srk2dei ABA signaling phopshoproteomics",83,23572148,"MASCOT Score",24.0000000,,,,,,-0.0074000
KGYDASGDNDEEIPDELEFSDDEK,ph,S,494,true,"Tissue atlas Arabidopsis - ProteomicsDB",114,32188942,"MaxQuant score",138.0800000,1.0000000,,,,3.229559952317E-35,
GYDASGDNDEEIPDELEFSDDEK,ph,S,494,true,"srk2dei ABA signaling phopshoproteomics",83,23572148,"MASCOT Score",50.0000000,,,,,,-0.0055000
GYDASGDNDEEIPDELEFSDDEK,ph,S,494,true,"TOR Kinase and ABA Receptor",100,29290610,XCorr,5.3625507,1.0000000,,,,0.00024930000654422,
