Peptide,PTM,ModifiedAA,ModifiedPosition,PeptideUniqueToGene,ExperimentDesc,ExpID,PubmedID,ScoreType,IdentScore,LocProb,Log2FChange,PQ-val,QuantSig,PEP,MassErrorPPM
SVSIEKEVPETERPFTFLR,nt,S,48,false,"Stromal N-terminome",96,26371235,"MASCOT Score",47.5400000,,,,,,
SVSIEKEVPETERPFTFLR,nt,S,48,false,"HUNTER N-terminome: legumain, GluC and trypsin",119,31951383,"MaxQuant score",93.8040000,,,,,,
SVSIEKEVPETERPFTFLR,nt,S,48,false,"Arabidopsis translation initiation landscape - NT",167b,35069635,,,,,,,,
SVSIEKEVPETERPFTFLR,nta,S,48,false,"Stromal N-terminome",96,26371235,"MASCOT Score",31.1800000,,,,,,
SVSIEKEVPETERPFTFLR,nta,S,48,false,"FtsH12 N-terminome: WT / FtsH12 knockdown miRNA",118,33216923,"MaxQuant score",93.1760000,,,,,1.6699999944112E-15,
VSIEKEVPETERPFTFLR,nt,V,49,false,"Stromal N-terminome",96,26371235,"MASCOT Score",34.9300000,,,,,,
VSIEKEVPETERPFTFLR,nt,V,49,false,"Arabidopsis translation initiation landscape - NT",167b,35069635,,,,,,,,
VSIEKEVPETERPFTFLR,nta,V,49,false,"Stromal N-terminome",96,26371235,"MASCOT Score",34.9300000,,,,,,
SIEKEVPETERPFTFLR,nt,S,50,false,"HUNTER N-terminome: legumain, GluC and trypsin",119,31951383,"MaxQuant score",52.0260000,,,,,,
DSDDVTPSSSSSSVR,nt,D,67,true,"Metacaspase9 substrates - in vitro rMC9",51c,23964026,"MASCOT Score",40.0000000,,1.4166627,,NO,,-0.3762472
DSDDVTPSSSSSSVR,nt,D,67,true,"Tic56 chloroplast import - wild-type",89a,25588737,XCorr,3.0852077,,,,,,
DSDDVTPSSSSSSVR,nt,D,67,true,"Tic56 chloroplast import - tic56-1",89c,25588737,XCorr,2.4813333,,,,,,
DSDDVTPSSSSSSVR,nt,D,67,true,"Arg/N-end rule seed, prt6 vs. Wt",99,29168982,"MASCOT Score",48.8900000,,-0.5626915,0.4505268,NO,0.0042739999480546,-0.9684068
AAQDSVCDAIEAIEGGPK,sno,C,96,true,"Site-specific nitrosomeproteomic id - gsnor1-3",90a,25699590,XCorr,3.0600000,,,,,0.017410000786185,-6.1200000
AAQDSVCDAIEAIEGGPK,sno,C,96,true,"Site-specific nitrosomeproteomic id - gsnor1-3",90b,25699590,XCorr,4.5800000,,,,,0.0036859998945147,-7.2200000
AAQDSVCDAIEAIEGGPK,sno,C,96,true,"hot5-4 / wildtype, FAT-switch S-nitrosoproteome",169,37277371,,,,,,,,
SVLHPKNPFAPT,nt,S,175,true,"N-terminal ChaFRADIC",92,26010716,"MASCOT Score",34.5900000,,,,,0.0024659999180585,
WCDDYFYIKHR,ac,K,260,true,"Histone deacetylases substrates - hda14 vs WT",98e,29061669,"MaxQuant Score",53.6000000,1.0000000,0.3820000,0.2517677,NO,0.003000000026077,
ANSVVPAYIPIVE,nt,A,292,true,"Arg/N-end rule seed, prt6 vs. Wt",99,29168982,"MASCOT Score",28.5700000,,-0.1539888,0.7943918,NO,0.00015979999443516,0.7682625
DMEFTEQHK,mox,M,309,true,"cat2 Methionine oxidation - 1h stress",62a,25693801,"MASCOT Score",51.0000000,,0.2011557,,NO,,
DMEFTEQHK,mox,M,309,true,"cat2 Methionine oxidation - 3h stress",62b,25693801,"MASCOT Score",34.0000000,,0.2197102,,NO,,
SILVSLPLSARWE,nt,S,349,true,"N-terminal ChaFRADIC",92,26010716,"MASCOT Score",30.4600000,,,,,2.2579999495065E-5,
LLDACINPK,ox,C,379,true,"OxiTRAQ Arabidopsis - 5 mM H2O2 versus control",47,24376095,,,,-0.3192378,0.0672574,NO,,
LLDACINPK,sno,C,379,true,"Site-specific nitrosomeproteomic id - gsnor1-3",90b,25699590,XCorr,2.7200000,,,,,0.28639999032021,-6.8300000
LLDACINPK,sno,C,379,true,"hot5-4 / wildtype, FAT-switch S-nitrosoproteome",169,37277371,,,,-0.0374826,0.6600039,NO,,
