Peptide,PTM,ModifiedAA,ModifiedPosition,PeptideUniqueToGene,ExperimentDesc,ExpID,PubmedID,ScoreType,IdentScore,LocProb,Log2FChange,PQ-val,QuantSig,PEP,MassErrorPPM
NSVLDLTSSGDQTSASR,ph,S,129,true,"atm and atr DNA damage response",88,25561503,"MASCOT Score",93.0000000,1.0000000,,,,,-1.2200000
NSVLDLTSSGDQTSASR,ph,S,129,true,"TOR Kinase and ABA Receptor",100,29290610,XCorr,5.4741473,1.0000000,,,,9.1539999402812E-7,
NSVLDLTSSGDQTSASR,ph,S,129,true,"Tissue atlas Arabidopsis - ProteomicsDB",114,32188942,"MaxQuant score",191.4700000,1.0000000,,,,5.0061499741881E-39,
TSSGDQTSASRSP,nta,T,134,true,"Arabidopsis translation initiation landscape - NTA",167a,35069635,,,,,,,,
NSVLDLTSSGDQTSASR,ph,S,136,true,"Tissue atlas Arabidopsis - ProteomicsDB",114,32188942,"MaxQuant score",235.4000000,0.9465770,,,,0,
NSVLDLTSSGDQTSASRSPDLR,ph,S,145,true,"atm and atr DNA damage response",88,25561503,"MASCOT Score",36.0000000,0.8920000,,,,,0.0600000
NSVLDLTSSGDQTSASRSPDLR,ph,S,145,true,"Tissue atlas Arabidopsis - ProteomicsDB",114,32188942,"MaxQuant score",189.6400000,0.9989580,,,,0,
LESPIDPSTCASPSRSDDASSIPQTTFAGR,ph,S,161,true,"TOR Kinase and ABA Receptor",100,29290610,XCorr,4.5783367,0.8409000,,,,2.0229999790899E-5,
LESPIDPSTCASPSR,ph,S,161,true,"LAXIC - ABA stress",84a,23660473,XCorr,3.2400000,0.7960000,,,,0.0044932002201676,
LESPIDPSTCASPSR,ph,S,161,true,"atm and atr DNA damage response",88,25561503,"MASCOT Score",53.0000000,0.9240000,,,,,-0.8300000
LESPIDPSTCASPSR,ph,S,161,true,"Tissue atlas Arabidopsis - ProteomicsDB",114,32188942,"MaxQuant score",231.4100000,0.9949900,,,,0,
NAITATPTQSSSR,ph,T,192,true,"Tissue atlas Arabidopsis - ProteomicsDB",114,32188942,"MaxQuant score",167.3200000,0.9997040,,,,1.8106999596533E-14,
NAITATPTQSSSR,ph,T,194,true,"Tissue atlas Arabidopsis - ProteomicsDB",114,32188942,"MaxQuant score",194.5900000,0.8257850,,,,5.4820599047773E-30,
SPQTNSAFQK,ph,S,683,true,"Tissue atlas Arabidopsis - ProteomicsDB",114,32188942,"MaxQuant score",76.3260000,0.9998370,,,,0.0030058498959988,
LQSEESGLFLGVDDVR,ph,S,838,true,"TOR Kinase and ABA Receptor",100,29290610,XCorr,4.4941320,0.9074000,,,,2.5910001113516E-6,
LQSEESGLFLGVDDVR,ph,S,838,true,"Tissue atlas Arabidopsis - ProteomicsDB",114,32188942,"MaxQuant score",298.0000000,1.0000000,,,,0,
