Peptide,PTM,ModifiedAA,ModifiedPosition,PeptideUniqueToGene,ExperimentDesc,ExpID,PubmedID,ScoreType,IdentScore,LocProb,Log2FChange,PQ-val,QuantSig,PEP,MassErrorPPM
EEILKKR,ub,K,11,false,"Arabidopsis ubiquitination COFRADIC",40,26744219,"MaxQuant Score",81.2970000,0.9160000,,,,0.0099999997764826,0.6350000
SLAEESGGKK,ac,K,22,true,"Quantitative Acetylproteomics",101,29440448,,,,,,,,
AAAAASGGDGKSSGSAPGSSNAATSASSK,fuc,S,68,true,"SPINDLY O-fucosylation",162,36739885,,,,,,,-1,
SSGSAPGSSNAATSASSK,fuc,S,68,true,"SPINDLY O-fucosylation",162,36739885,,,,,,,-0.41999998688698,
SSGSAPGSSNAATSASSK,fuc,S,72,true,"SPINDLY O-fucosylation",162,36739885,,,,,,,-1.5,
SSGSAPGSSNAATSASSKSSASDAAAIADSK,fuc,T,77,true,"SPINDLY O-fucosylation",162,36739885,,,,,,,1.2999999523163,
AAAAASGGDGKSSGSAPGSSNAATSASSK,fuc,S,78,true,"SPINDLY O-fucosylation",162,36739885,,,,,,,-1.2000000476837,
DIAELKKR,ub,K,166,true,"Arabidopsis ubiquitination COFRADIC",40,26744219,"MaxQuant Score",68.2240000,0.8940000,,,,0.012000000104308,-0.4880000
EDELSGGESSDVDADKDMKR,ph,S,200,true,"STN8 phosphoproteome",38,21768351,"MASCOT Score",46.4400000,,,,,,
EDELSGGESSDVDADKDMKR,ph,S,200,true,"Tissue atlas Arabidopsis - ProteomicsDB",114,32188942,"MaxQuant score",213.6900000,1.0000000,,,,0,
EDELSGGESSDVDADKDMK,ph,S,200,true,"Large-scale phosphorylation discovery",44,23111157,XCorr,3.7230000,,,,,,
EDELSGGESSDVDADKDMK,ph,S,200,true,"LAXIC - mannitol vs control",84b,23660473,XCorr,4.3700000,1.0000000,,,,7.730000106676E-6,
EDELSGGESSDVDADK,ph,S,200,true,"Large-scale phosphorylation discovery",44,23111157,XCorr,3.5310000,,,,,,
EDELSGGESSDVDADK,ph,S,200,true,"Tyrosine phosphorylation in Arabidopsis",59,18463617,"MASCOT Score",36.0000000,,,,,,-1.0394806
EDELSGGESSDVDADK,ph,S,200,true,"Lateral root-induction - NAA vs control",106,23328941,"MASCOT Score",50.0000000,,,,,,
EDELSGGESSDVDADKDMK,ph,S,204,true,"LAXIC - mannitol vs control",84b,23660473,XCorr,4.3700000,0.9220000,,,,7.730000106676E-6,
EDELSGGESSDVDADK,ph,S,204,true,"Large-scale phosphorylation discovery",44,23111157,XCorr,3.5310000,,,,,,
EDELSGGESSDVDADK,ph,S,204,true,"Lateral root-induction - NAA vs control",106,23328941,"MASCOT Score",50.0000000,,,,,,
EDELSGGESSDVDADKDMKR,ph,S,205,true,"Tissue atlas Arabidopsis - ProteomicsDB",114,32188942,"MaxQuant score",213.6900000,1.0000000,,,,0,
EDELSGGESSDVDADK,ph,S,205,true,"Large-scale phosphorylation discovery",44,23111157,XCorr,3.5310000,,,,,,
YLVPLFNLCR,ox,C,278,true,"OxiTRAQ SA and flg22 responses - SA vs mock",91a,25720653,"MASCOT Score",41.4100000,,1.2078929,0.0130000,YES,,
YLVPLFNLCR,ox,C,278,true,"OxiTRAQ SA and flg22 responses - flg22 vs mock",91b,25720653,"MASCOT Score",41.4100000,,1.0635029,0.0760000,NO,,
