Peptide,PTM,ModifiedAA,ModifiedPosition,PeptideUniqueToGene,ExperimentDesc,ExpID,PubmedID,ScoreType,IdentScore,LocProb,Log2FChange,PQ-val,QuantSig,PEP,MassErrorPPM
SLSFTK,ph,S,36,false,"srk2dei ABA signaling phopshoproteomics",83,23572148,"MASCOT Score",27.0000000,,,,,,0.0004000
SLSFTK,ph,S,36,false,"TOR Kinase and ABA Receptor",100,29290610,XCorr,2.7426026,0.9904000,,,,0.0085089998319745,
AEKTESSSAAPAVKEAPVGFTPPQLDPN,nt,A,44,true,"HUNTER N-terminome: legumain, GluC and trypsin",119,31951383,"MaxQuant score",86.7320000,,,,,,
EKTESSSAAPAVKEAPVGFTPPQLDPNTPSPIFAGSTGGLLR,nt,E,45,true,"Stromal N-terminome",96,26371235,"MASCOT Score",46.4300000,,,,,,
EKTESSSAAPAVKEAPVGFTPPQLDPN,nt,E,45,true,"HUNTER N-terminome: legumain, GluC and trypsin",119,31951383,"MaxQuant score",174.5900000,,,,,,
EKTESSSAAPAVKEAPVGFTPPQLD,nt,E,45,true,"HUNTER N-terminome: legumain, GluC and trypsin",119,31951383,"MaxQuant score",67.9920000,,,,,,
EKTESSSAAPAVK,nt,E,45,true,"N-terminal ChaFRADIC",92,26010716,"MASCOT Score",22.6300000,,,,,3.540999958529E-13,
SSSAAPAVKE,nt,S,49,true,"N-terminal ChaFRADIC",92,26010716,"MASCOT Score",33.2500000,,,,,1.2440000318747E-5,
SSAAPAVKE,nt,S,50,true,"N-terminal ChaFRADIC",92,26010716,"MASCOT Score",42.7500000,,,,,0.024949999526143,
SSAAPAVKE,nta,S,50,true,"N-terminal ChaFRADIC",92,26010716,"MASCOT Score",42.7500000,,,,,0.024949999526143,
EAPVGFTPPQLDPNTPSPIFAGSTGGLLR,nt,E,58,false,"Metacaspase9 substrates - in vitro rMC9",51c,23964026,"MASCOT Score",59.0000000,,3.7374407,,NO,,-0.9648807
KAQVEEFYVITWNSPK,ac,K,87,false,"Histone deacetylases - hda14 vs WT (thylakoids)",98d,29061669,"MaxQuant Score",50.8000000,1.0000000,0.6020000,0.8394600,NO,0.00015900000289548,
EGPNLLKLAR,ac,K,124,false,"Histone deacetylases - apicidin vs control",98a,29061669,"MaxQuant Score",189.0000000,1.0000000,0.1240000,0.4405549,NO,6.8999936383354E-41,
EGPNLLKLAR,ac,K,124,false,"Histone deacetylases substrates - TSA vs control",98b,29061669,"MaxQuant Score",189.0000000,1.0000000,-0.1840000,0.9794900,NO,6.8999936383354E-41,
EGPNLLKLAR,ac,K,124,false,"Histone deacetylases- hda14 vs WT (low light)",98c,29061669,"MaxQuant Score",136.5000000,1.0000000,0.8340000,0.9885531,NO,0.0010000000474975,
EGPNLLKLAR,ac,K,124,false,"Histone deacetylases - hda14 vs WT (thylakoids)",98d,29061669,"MaxQuant Score",133.9000000,1.0000000,0.1420000,0.9571941,NO,3.1700001272839E-5,
EGPNLLKLAR,ac,K,124,false,"Histone deacetylases substrates - hda14 vs WT",98e,29061669,"MaxQuant Score",215.8000000,1.0000000,-0.0850000,0.9099133,NO,0,
EGPNLLKLAR,ac,K,124,false,"Quantitative Acetylproteomics",101,29440448,,,,,,,,
EGPNLLKLAR,ub,K,124,false,"Arabidopsis ubiquitination COFRADIC",40,26744219,"MaxQuant Score",51.4450000,1.0000000,,,,0.025000000372529,0.5970000
KEQCLALGTR,sno,C,131,false,"Site-specific nitrosomeproteomic id - gsnor1-3",90a,25699590,XCorr,3.3532619,,,,,0.0016210000030696,-6.8938641
KEQCLALGTR,sno,C,131,false,"Site-specific nitrosomeproteomic id - gsnor1-3",90b,25699590,XCorr,3.6600000,,,,,0.052609998732805,-7.1300000
EQCLALGTR,sno,C,131,false,"Cold stress nitrosylation - 4°C vs 22°C",65,24388526,,,,,,,,
EQCLALGTR,sno,C,131,false,"Site-specific nitrosomeproteomic id - gsnor1-3",90a,25699590,XCorr,2.4920783,,,,,0.031619999557734,-6.5754816
EQCLALGTR,sno,C,131,false,"hot5-4 / wildtype, FAT-switch S-nitrosoproteome",169,37277371,,,,,,,,
KEQCLALGTR,so,C,131,false,"Arabidopsis S-sulfenylation chemoproteomics",108,31578252,"pFind PSM Score",0.2299360,,0.8849600,,,,-0.6663431
YKITYQFYR,ac,K,143,false,"Quantitative Acetylproteomics",101,29440448,,,,,,,,
VFPNGEVQYLHPKDGVYPEK,ac,K,163,false,"Histone deacetylases- hda14 vs WT (low light)",98c,29061669,"MaxQuant Score",130.0500000,1.0000000,0.3150000,0.9885531,NO,2.0999999961191E-8,
VFPNGEVQYLHPKDGVYPEK,ac,K,163,false,"Histone deacetylases - hda14 vs WT (thylakoids)",98d,29061669,"MaxQuant Score",57.4000000,1.0000000,0.0820000,0.9817479,NO,1.1899999663001E-5,
VFPNGEVQYLHPKDGVYPEK,ac,K,163,false,"Quantitative Acetylproteomics",101,29440448,,,,,,,,
VFPNGEVQYLHPK,ac,K,163,false,"Quantitative Acetylproteomics",101,29440448,,,,,,,,
DGVYPEKANPGR,ac,K,170,false,"Histone deacetylases - apicidin vs control",98a,29061669,"MaxQuant Score",129.3000000,1.0000000,-0.3060000,0.1258925,NO,6.1000000962431E-15,
DGVYPEKANPGR,ac,K,170,false,"Histone deacetylases substrates - TSA vs control",98b,29061669,"MaxQuant Score",129.3000000,1.0000000,-0.0480000,0.9977001,NO,6.1000000962431E-15,
DGVYPEKANPGR,ac,K,170,false,"Histone deacetylases- hda14 vs WT (low light)",98c,29061669,"MaxQuant Score",156.0000000,1.0000000,0.0770000,0.9931160,NO,9.9999997473788E-6,
DGVYPEKANPGR,ac,K,170,false,"Histone deacetylases - hda14 vs WT (thylakoids)",98d,29061669,"MaxQuant Score",86.8000000,1.0000000,0.2800000,0.8394600,NO,0.00014200000441633,
DGVYPEKANPGR,ac,K,170,false,"Histone deacetylases substrates - hda14 vs WT",98e,29061669,"MaxQuant Score",140.1000000,1.0000000,0.4680000,0.3411929,NO,3.099999949645E-28,
SIGKNVSPIEVK,ac,K,187,false,"Histone deacetylases substrates - TSA vs control",98b,29061669,"MaxQuant Score",121.2000000,1.0000000,1.7660000,0.1106624,NO,1.7000000696044E-7,
SIGKNVSPIEVK,ac,K,187,false,"Histone deacetylases - hda14 vs WT (thylakoids)",98d,29061669,"MaxQuant Score",157.9000000,1.0000000,0.9480000,0.3741106,NO,1.05999996107E-12,
SIGKNVSPIEVK,ac,K,187,false,"Quantitative Acetylproteomics",101,29440448,,,,,,,,
NVSPIEVK,ph,S,190,false,"atm and atr DNA damage response",88,25561503,"MASCOT Score",31.0000000,1.0000000,,,,,-1.3800000
NVSPIEVK,ph,S,190,false,"Tissue atlas Arabidopsis - ProteomicsDB",114,32188942,"MaxQuant score",132.3200000,1.0000000,,,,0.0028256298974156,
NVSPIEVKFTGK,ac,K,195,false,"Histone deacetylases - apicidin vs control",98a,29061669,"MaxQuant Score",92.9000000,1.0000000,0.1220000,0.4764310,NO,1.8000000379104E-9,
NVSPIEVKFTGK,ac,K,195,false,"Histone deacetylases substrates - TSA vs control",98b,29061669,"MaxQuant Score",92.9000000,1.0000000,0.0330000,0.9977001,NO,1.8000000379104E-9,
NVSPIEVKFTGK,ac,K,195,false,"Histone deacetylases - hda14 vs WT (thylakoids)",98d,29061669,"MaxQuant Score",94.7000000,1.0000000,0.6880000,0.6165950,NO,4.2700001358753E-5,
NVSPIEVKFTGK,ac,K,195,false,"Histone deacetylases substrates - hda14 vs WT",98e,29061669,"MaxQuant Score",51.7000000,1.0000000,1.0530000,0.1081434,NO,0.0020000000949949,
NVSPIEVKFTGK,ac,K,195,false,"Quantitative Acetylproteomics",101,29440448,,,,,,,,
NVSPIEVK,ac,K,195,false,"Quantitative Acetylproteomics",101,29440448,,,,,,,,
NVSPIEVKFTGK,cr,K,195,false,"Open search Plant PTM Viewer 2.0 - Crotonylation",164c,TBA,,,,,,,,
FTGKQSYDL,ac,K,199,false,"Histone deacetylases - hda14 vs WT (thylakoids)",98d,29061669,"MaxQuant Score",70.9000000,1.0000000,1.8280000,0.1761976,NO,0.018999999389052,
