Peptide,PTM,ModifiedAA,ModifiedPosition,PeptideUniqueToGene,ExperimentDesc,ExpID,PubmedID,ScoreType,IdentScore,LocProb,Log2FChange,PQ-val,QuantSig,PEP,MassErrorPPM
ISGSASMKPKEQCIEKILVANR,nt,I,25,true,"Mitochondrial intermediate peptidases - oct1-2 / WT",131c,25732537,,50.0100000,,-0.3056303,,,,
SSDFAQLCE,nt,S,124,true,"N-terminal ChaFRADIC",92,26010716,"MASCOT Score",31.1400000,,,,,0.0089680003002286,
DCSVQR,sno,C,265,false,"hot5-4 / wildtype, FAT-switch S-nitrosoproteome",169,37277371,,,,,,,,
DCLSNFQVAGVPTNINFLQK,ox,C,424,true,"Redox kickstart of mitochondria",112,31871212,,,,-0.9274208,0.0022979,YES,,
VGIEFSEDEEGVQHR,ph,S,625,true,"STN8 phosphoproteome",38,21768351,"MASCOT Score",76.1000000,,,,,,-1.2989400
VGIEFSEDEEGVQHR,ph,S,625,true,"Chloroplast kinase substrates",60,19376835,"MASCOT Score",50.8000000,,,,,,-0.6547480
VGIEFSEDEEGVQHR,ph,S,625,true,"atm and atr DNA damage response",88,25561503,"MASCOT Score",68.0000000,1.0000000,,,,,-0.2500000
VGIEFSEDEEGVQHR,ph,S,625,true,"Phospho cell culture sucrose/TOR",109,30833711,,,1.0000000,,,,,
VGIEFSEDEEGVQHR,ph,S,625,true,"Tissue atlas Arabidopsis - ProteomicsDB",114,32188942,"MaxQuant score",106.2800000,1.0000000,,,,2.1166699752939E-6,
