Peptide,PTM,ModifiedAA,ModifiedPosition,PeptideUniqueToGene,ExperimentDesc,ExpID,PubmedID,ScoreType,IdentScore,LocProb,Log2FChange,PQ-val,QuantSig,PEP,MassErrorPPM
SRTSSVDSIYDETWEQGSGK,ph,T,473,true,"Tissue atlas Arabidopsis - ProteomicsDB",114,32188942,"MaxQuant score",205.9500000,0.9397820,,,,0,
TSSVDSIYDETWEQGSGK,ph,T,473,true,"SnRK2 protein kinase substrates",85,23776212,XCorr,2.9528160,0.8390000,,,,2.4561001019455E-13,
TSSVDSIYDETWEQGSGK,ph,T,473,true,"Lateral root-induction - NAA vs control",106,23328941,"MASCOT Score",40.0000000,,,,,,
TSSVDSIYDETWEQGSGK,ph,S,475,true,"srk2dei ABA signaling phopshoproteomics",83,23572148,"MASCOT Score",36.0000000,,,,,,0.0006000
TSSVDSIYDETWEQGSGK,ph,S,475,true,"Tissue atlas Arabidopsis - ProteomicsDB",114,32188942,"MaxQuant score",217.3200000,0.8556500,,,,0,
LLIGPDQYSGVSSHSDR,ph,S,644,true,"Tissue atlas Arabidopsis - ProteomicsDB",114,32188942,"MaxQuant score",126.1400000,0.8519730,,,,1.3404900522929E-9,
DAIISSPK,ph,S,667,false,"Tissue atlas Arabidopsis - ProteomicsDB",114,32188942,"MaxQuant score",101.6500000,0.8321910,,,,0.0068330601789057,
DAIISSPK,ph,S,668,false,"Tissue atlas Arabidopsis - ProteomicsDB",114,32188942,"MaxQuant score",103.2600000,0.9468770,,,,0.0045834500342607,
LMESGSGK,ph,S,676,false,"atm and atr DNA damage response",88,25561503,"MASCOT Score",25.0000000,0.9310000,,,,,-2.9200000
FRYDSSSVGSHGDMDDFSVPK,ph,Y,1525,true,"srk2dei ABA signaling phopshoproteomics",83,23572148,"MASCOT Score",26.0000000,,,,,,0.0002000
FRYDSSSVGSHGDMDDFSVPK,ph,S,1532,true,"srk2dei ABA signaling phopshoproteomics",83,23572148,"MASCOT Score",26.0000000,,,,,,0.0002000
YDSSSVGSHGDMDDFSVPK,ph,S,1532,true,"atm and atr DNA damage response",88,25561503,"MASCOT Score",51.0000000,0.9920000,,,,,-0.5700000
YDSSSVGSHGDMDDFSVPK,ph,S,1532,true,"Tissue atlas Arabidopsis - ProteomicsDB",114,32188942,"MaxQuant score",112.6100000,0.9951630,,,,8.6180597380636E-11,
HINDADDSGSQGSLPHDQDQSTK,ph,S,1963,true,"LAXIC - mannitol vs control",84b,23660473,XCorr,4.8200000,0.8690000,,,,1.7300000321185E-10,
HINDADDSGSQGSLPHDQDQSTK,ph,S,1963,true,"atm and atr DNA damage response",88,25561503,"MASCOT Score",67.0000000,0.8640000,,,,,-0.4700000
HINDADDSGSQGSLPHDQDQSTK,ph,S,1963,true,"TOR Kinase and ABA Receptor",100,29290610,XCorr,5.3668580,0.9839000,,,,1.1520000242626E-7,
HINDADDSGSQGSLPHDQDQSTK,ph,S,1963,true,"Tissue atlas Arabidopsis - ProteomicsDB",114,32188942,"MaxQuant score",294.2300000,0.9981740,,,,0,
HINDADDSGSQGSLPHDQDQSTK,ph,S,1966,true,"LAXIC - mannitol vs control",84b,23660473,XCorr,3.8900000,0.9920000,,,,3.1299998227041E-5,
HINDADDSGSQGSLPHDQDQSTK,ph,S,1966,true,"SnRK2 protein kinase substrates",85,23776212,XCorr,4.3731337,0.7760000,,,,0.0073919999413192,
HINDADDSGSQGSLPHDQDQSTK,ph,S,1966,true,"TOR Kinase and ABA Receptor",100,29290610,XCorr,5.3668580,0.9978000,,,,1.1520000242626E-7,
HINDADDSGSQGSLPHDQDQSTK,ph,S,1966,true,"Tissue atlas Arabidopsis - ProteomicsDB",114,32188942,"MaxQuant score",138.7200000,0.9999340,,,,1.4700799307542E-29,
SLQGVEDVKK,ph,S,2022,true,"Tissue atlas Arabidopsis - ProteomicsDB",114,32188942,"MaxQuant score",92.7920000,1.0000000,,,,0.00068349199136719,
KQDDHHVGPSASSER,ph,S,2043,true,"Tissue atlas Arabidopsis - ProteomicsDB",114,32188942,"MaxQuant score",111.2700000,0.9173540,,,,1.8642500435817E-5,
VKNEDGPVISDTDSEPPFLLSELYDESFLK,ph,S,2647,true,"SnRK2 protein kinase substrates",85,23776212,XCorr,3.7374289,0.8590000,,,,1.3273800114622E-10,
VKNEDGPVISDTDSEPPFLLSELYDESFLK,ph,S,2647,true,"Brassinosteroid-Regulated Phosphorylation Dynamics",94,26187819,"MaxQuant Score",87.2800000,0.8810000,,,,1.2499999684223E-5,0.6340000
VKNEDGPVISDTDSEPPFLLSELYDESFLK,ph,T,2649,true,"Brassinosteroid-Regulated Phosphorylation Dynamics",94,26187819,"MaxQuant Score",87.2800000,0.8370000,,,,1.2499999684223E-5,-0.0310000
VKNEDGPVISDTDSEPPFLLSELYDESFLK,ph,S,2651,true,"Brassinosteroid-Regulated Phosphorylation Dynamics",94,26187819,"MaxQuant Score",87.2800000,0.9680000,,,,1.2499999684223E-5,-0.0310000
ESDDFKDVASAR,ph,S,2677,true,"STN8 phosphoproteome",38,21768351,"MASCOT Score",53.7000000,,,,,,0.4312670
ESDDFKDVASAR,ph,S,2677,true,"atm and atr DNA damage response",88,25561503,"MASCOT Score",55.0000000,1.0000000,,,,,-0.8400000
ESDDFKDVASAR,ph,S,2677,true,"Tissue atlas Arabidopsis - ProteomicsDB",114,32188942,"MaxQuant score",180.7000000,1.0000000,,,,2.0363100634948E-19,
ASSTNEASLHSALDFGGK,ph,S,2689,true,"Tissue atlas Arabidopsis - ProteomicsDB",114,32188942,"MaxQuant score",104.8900000,0.8939240,,,,5.7689101140568E-7,
SSIASVPITDTTHVKSETGSPR,ph,S,2720,true,"Tissue atlas Arabidopsis - ProteomicsDB",114,32188942,"MaxQuant score",156.9200000,0.9820200,,,,1.5642499696512E-37,
SSIASVPITDTTHVKSETGSPR,ph,S,2724,true,"Tissue atlas Arabidopsis - ProteomicsDB",114,32188942,"MaxQuant score",139.4100000,0.9654310,,,,7.6018097963948E-29,
EEKSEKELNDDGEYLIR,ph,S,2743,true,"atm and atr DNA damage response",88,25561503,"MASCOT Score",28.0000000,1.0000000,,,,,-1.3700000
DVSGSSDFHSK,ph,S,2830,true,"Tissue atlas Arabidopsis - ProteomicsDB",114,32188942,"MaxQuant score",112.0200000,0.8364000,,,,3.2320498576155E-5,
SSTSWTTTVK,ph,T,2839,true,"Tissue atlas Arabidopsis - ProteomicsDB",114,32188942,"MaxQuant score",104.8200000,0.7653420,,,,0.0008174370159395,
LSFVR,ph,S,3413,false,"Sucrose-induced phosphorylation",24,17586839,,,,,,,,
MIHCTDPVSAESK,ph,S,3507,true,"Tissue atlas Arabidopsis - ProteomicsDB",114,32188942,"MaxQuant score",198.8100000,0.9999960,,,,7.5214001335387E-31,
