Peptide,PTM,ModifiedAA,ModifiedPosition,PeptideUniqueToGene,ExperimentDesc,ExpID,PubmedID,ScoreType,IdentScore,LocProb,Log2FChange,PQ-val,QuantSig,PEP,MassErrorPPM
VSLKLQKR,nt,V,2,false,"Arg/N-end rule pathway Roots",80,25728785,"MASCOT Score",33.0900000,,,,,0.017009999603033,
VSLKLQKR,nt,V,2,false,"Arabidopsis translation initiation landscape - NT",167b,35069635,,,,,,,,
VSLKLQKR,ub,K,8,false,"Arabidopsis ubiquitination COFRADIC",40,26744219,"MaxQuant Score",47.5740000,0.8490000,,,,0.030999999493361,0.4070000
RLAASVMK,mox,M,15,false,"cat2 Methionine oxidation - 3h stress",62b,25693801,"MASCOT Score",40.0000000,,0.0981196,,NO,,
GKVWLDPNESSDISMANSR,ub,K,21,true,"Ubiquitination Membrane Proteins",120,33585938,,,,,,,,
VWLDPNESSDISMANSR,ph,S,29,true,"Lateral root-induction - NAA vs control",106,23328941,"MASCOT Score",23.0000000,,,,,,
VWLDPNESSDISMANSR,ph,S,30,true,"TOR Kinase and ABA Receptor",100,29290610,XCorr,3.7795787,0.9927000,,,,7.5010000728071E-5,
VWLDPNESSDISMANSR,ph,S,30,true,"Tissue atlas Arabidopsis - ProteomicsDB",114,32188942,"MaxQuant score",147.9200000,0.8685290,,,,2.2950400260791E-12,
KLVKDGFIIR,ub,K,43,false,"Arabidopsis ubiquitination COFRADIC",40,26744219,"MaxQuant Score",143.9700000,1.0000000,,,,8.0930001589152E-10,-0.4370000
KLVKDGFIIR,ub,K,43,false,"Ubiquitination Membrane Proteins",120,33585938,,,,,,,,
KLVKDGFIIR,ac,K,46,false,"Quantitative Acetylproteomics",101,29440448,,,,,,,,
KLVKDGFIIR,ub,K,46,false,"Arabidopsis ubiquitination COFRADIC",40,26744219,"MaxQuant Score",143.9700000,1.0000000,,,,8.0930001589152E-10,-0.4370000
KLVKDGFIIR,ub,K,46,false,"Ubiquitination Membrane Proteins",120,33585938,,,,,,,,
KPTKIHSR,ub,K,53,false,"Arabidopsis ubiquitination COFRADIC",40,26744219,"MaxQuant Score",112.3600000,1.0000000,,,,0.0010000000474975,-0.5750000
HSGYGKR,nt,H,75,false,"Arabidopsis translation initiation landscape - NT",167b,35069635,,,,,,,,
HSGYGKR,ub,K,80,false,"Arabidopsis ubiquitination COFRADIC",40,26744219,"MaxQuant Score",108.2400000,1.0000000,,,,0.0080000003799796,0.0560000
GNVFKNK,ac,K,133,false,"Quantitative Acetylproteomics",101,29440448,,,,,,,,
VKGNVFKNKR,ub,K,135,false,"Arabidopsis ubiquitination COFRADIC",40,26744219,"MaxQuant Score",113.9300000,0.9890000,,,,9.7500000265427E-5,-0.3290000
VLMESIHKSK,ac,K,144,false,"Quantitative Acetylproteomics",101,29440448,,,,,,,,
VLMESIHKSKAEKAR,ub,K,144,false,"Arabidopsis ubiquitination COFRADIC",40,26744219,"MaxQuant Score",84.4100000,0.9400000,,,,1.2570000080814E-6,0.4870000
SKAEKAR,nt,S,145,false,"Metacaspase9 substrates - 35S:MC9 / mc9",51b,23964026,"MASCOT Score",49.0000000,,2.8511160,,NO,,0.1978991
SKAEKAR,nt,S,145,false,"Arabidopsis translation initiation landscape - NT",167b,35069635,,,,,,,,
VLMESIHKSKAEKAR,ub,K,146,false,"Arabidopsis ubiquitination COFRADIC",40,26744219,"MaxQuant Score",100.4300000,0.9190000,,,,5.5070001891977E-9,-0.4870000
VLMESIHKSKAEKAR,ub,K,149,false,"Arabidopsis ubiquitination COFRADIC",40,26744219,"MaxQuant Score",93.4240000,0.9980000,,,,6.623999979638E-7,-1.8360000
EKTLSDQFEAKR,ub,K,153,false,"Arabidopsis ubiquitination COFRADIC",40,26744219,"MaxQuant Score",182.1000000,1.0000000,,,,0,1.1200000
EKTLSDQFEAK,ub,K,153,false,"upl3 mutant / wildtype",168,35926874,"MaxQuant score",91.9610000,1.0000000,-1.2344653,0.1568780,NO,0.00023012400197331,0.9121900
TLSDQFEAKR,nt,T,154,false,"Metacaspase9 substrates - in vitro rMC9",51c,23964026,"MASCOT Score",56.0000000,,,,,,-0.3749002
EKTLSDQFEAK,ph,T,154,false,"atm and atr DNA damage response",88,25561503,"MASCOT Score",37.0000000,0.9990000,,,,,-2.6200000
EKTLSDQFEAK,ph,T,154,false,"Tissue atlas Arabidopsis - ProteomicsDB",114,32188942,"MaxQuant score",255.1500000,0.9999680,,,,0,
EKTLSDQFEAK,ph,S,156,false,"atm and atr DNA damage response",88,25561503,"MASCOT Score",48.0000000,1.0000000,,,,,-1.8100000
TLSDQFEAK,ph,S,156,false,"atm and atr DNA damage response",88,25561503,"MASCOT Score",57.0000000,1.0000000,,,,,-0.4400000
TLSDQFEAK,ph,S,156,false,"TOR Kinase and ABA Receptor",100,29290610,XCorr,2.5824583,0.9983000,,,,0.0007624999852851,
TLSDQFEAK,ph,S,156,false,"Tissue atlas Arabidopsis - ProteomicsDB",114,32188942,"MaxQuant score",268.9000000,0.9999900,,,,0,
EKTLSDQFEAKR,ac,K,162,false,"Quantitative Acetylproteomics",101,29440448,,,,,,,,
TLSDQFEAKR,ac,K,162,false,"Histone deacetylases - apicidin vs control",98a,29061669,"MaxQuant Score",60.3000000,1.0000000,-0.3090000,0.3176874,NO,0.010999999940395,
TLSDQFEAKR,ac,K,162,false,"Quantitative Acetylproteomics",101,29440448,,,,,,,,
EKTLSDQFEAKR,ub,K,162,false,"Arabidopsis ubiquitination COFRADIC",40,26744219,"MaxQuant Score",182.1000000,1.0000000,,,,0,1.1200000
EKTLSDQFEAKR,ub,K,162,false,"Ubiquitination Membrane Proteins",120,33585938,,,,,,,,
TLSDQFEAKR,ub,K,162,false,"Ubiquitination Membrane Proteins",120,33585938,,,,,,,,
TLSDQFEAKR,ub,K,162,false,"upl3 mutant / wildtype",168,35926874,"MaxQuant score",115.7800000,1.0000000,-1.1520031,,,0.00036594399716705,0.5893700
AKNKASR,ub,K,165,false,"Arabidopsis ubiquitination COFRADIC",40,26744219,"MaxQuant Score",89.6980000,1.0000000,,,,0.0070000002160668,0.0540000
LAKGPGGDVAPVAAPAPAATPAPTAAVPK,ub,K,183,true,"Ubiquitination Membrane Proteins",120,33585938,,,,,,,,
LAKGPGGDVAPVAAPAPAATPAPTAAVPK,ub,K,183,true,"upl3 mutant / wildtype",168,35926874,"MaxQuant score",69.7020000,1.0000000,0.5528689,0.5994600,NO,5.4612301347845E-9,0.8212000
GPGGDVAPVAAPAPAATPAPTAAVPK,ph,T,200,true,"TOR Kinase and ABA Receptor",100,29290610,XCorr,6.0840893,0.9978000,,,,4.3639998281719E-9,
GPGGDVAPVAAPAPAATPAPTAAVPK,ph,T,200,true,"Lateral root-induction - NAA vs control",106,23328941,"MASCOT Score",30.0000000,,,,,,
GPGGDVAPVAAPAPAATPAPTAAVPK,ph,T,200,true,"Tissue atlas Arabidopsis - ProteomicsDB",114,32188942,"MaxQuant score",263.1600000,1.0000000,,,,0,
GPGGDVAPVAAPAPAATPAPTAAVPK,ph,T,204,true,"Tissue atlas Arabidopsis - ProteomicsDB",114,32188942,"MaxQuant score",271.8700000,1.0000000,,,,0,
