Peptide,PTM,ModifiedAA,ModifiedPosition,PeptideUniqueToGene,ExperimentDesc,ExpID,PubmedID,ScoreType,IdentScore,LocProb,Log2FChange,PQ-val,QuantSig,PEP,MassErrorPPM
EGDSVSHEPSTSK,ph,S,11,true,"Tissue atlas Arabidopsis - ProteomicsDB",114,32188942,"MaxQuant score",156.0800000,0.9999930,,,,6.8583699830427E-10,
EGDSVSHEPSTSKSPK,ph,S,17,true,"Tissue atlas Arabidopsis - ProteomicsDB",114,32188942,"MaxQuant score",178.0700000,0.8899980,,,,6.5655498768265E-27,
EGDSVSHEPSTSKSPK,ph,S,21,true,"Tissue atlas Arabidopsis - ProteomicsDB",114,32188942,"MaxQuant score",154.9500000,0.9356680,,,,4.1500501223469E-14,
FIDKLPQGLDTMVGEHGTQLSGGQK,ub,K,504,false,"upl3 mutant / wildtype",168,35926874,"MaxQuant score",58.8120000,1.0000000,,,,3.2454399843118E-6,-0.8027900
TSELSSGSSFR,ph,S,634,true,"Lateral root-induction - NAA vs control",106,23328941,"MASCOT Score",31.0000000,,,,,,
TSELSSGSSFR,ph,S,634,true,"Phospho cell culture sucrose/TOR",109,30833711,,,0.8296580,,,,,
TSELSSGSSFR,ph,S,634,true,"Tissue atlas Arabidopsis - ProteomicsDB",114,32188942,"MaxQuant score",228.7800000,0.9244200,,,,5.5603523064409E-42,
TSELSSGSSFRNSNLKK,ph,S,635,true,"Tissue atlas Arabidopsis - ProteomicsDB",114,32188942,"MaxQuant score",229.7500000,0.9610910,,,,4.8891303420293E-42,
TSELSSGSSFR,ph,S,635,true,"Phytohormone-responsive phosphoproteins",34,20374526,"MASCOT Score",43.0000000,,,,,,-2.4920000
TSELSSGSSFR,ph,S,635,true,"Large-scale phosphorylation discovery",44,23111157,XCorr,3.8340000,,,,,,
TSELSSGSSFR,ph,S,635,true,"Lateral root-induction - NAA vs control",106,23328941,"MASCOT Score",23.0000000,,,,,,
TSELSSGSSFR,ph,S,635,true,"Col-0 callus - FC Col-0 vs. Col-0 Xray",111a,31410901,,28.8200000,,-1.7763580,0.0000000,NO,,0.5439231
TSELSSGSSFR,ph,S,635,true,"Col-0 X-ray callus - FC Col-0 vs. Col-0 Xray",111b,31410901,,28.8200000,,-1.7763580,0.0000000,NO,,0.5439231
TSELSSGSSFR,ph,S,635,true,"atm callus - FC atm vs. atm Xray",111c,31410901,,28.8200000,,-0.8921423,0.0000000,NO,,0.5439231
TSELSSGSSFR,ph,S,635,true,"atm-3 X-ray callus - FC atm vs. atm Xray",111d,31410901,,28.8200000,,-0.8921423,0.0000000,NO,,0.5439231
TSELSSGSSFRNSNLK,ph,S,639,true,"Tissue atlas Arabidopsis - ProteomicsDB",114,32188942,"MaxQuant score",122.4700000,0.9995460,,,,6.8910399608768E-10,
SMEGTSSVGNSSR,ph,S,644,true,"Phytohormone-responsive phosphoproteins",34,20374526,"MASCOT Score",41.0000000,,,,,,-1.6486600
SMEGTSSVGNSSR,ph,S,644,true,"Tissue atlas Arabidopsis - ProteomicsDB",114,32188942,"MaxQuant score",104.7000000,0.9999910,,,,5.2748000598513E-5,
SMEGTSSVGNSSR,ph,S,654,true,"Tissue atlas Arabidopsis - ProteomicsDB",114,32188942,"MaxQuant score",172.9000000,0.9471420,,,,9.1371699245543E-16,
SMEGTSSVGNSSR,ph,S,655,true,"Tissue atlas Arabidopsis - ProteomicsDB",114,32188942,"MaxQuant score",133.2500000,0.9005780,,,,1.5353500202764E-5,
HHSLNVLGLTTGLDLGSHSQR,ph,S,675,true,"Tissue atlas Arabidopsis - ProteomicsDB",114,32188942,"MaxQuant score",167.5500000,0.9781060,,,,2.907040075247E-36,
SMCFEK,sno,C,789,false,"hot5-4 / wildtype, FAT-switch S-nitrosoproteome",169,37277371,,,,,,,,
TVASFCAEEK,sno,C,908,false,"hot5-4 / wildtype, FAT-switch S-nitrosoproteome",169,37277371,,,,,,,,
GIQLSGGQKQR,ac,K,1179,false,"Quantitative Acetylproteomics",101,29440448,,,,,,,,
LSTIKNADVIAVVK,ub,K,1236,false,"Ubiquitination Membrane Proteins",120,33585938,,,,,,,,
