Peptide,PTM,ModifiedAA,ModifiedPosition,PeptideUniqueToGene,ExperimentDesc,ExpID,PubmedID,ScoreType,IdentScore,LocProb,Log2FChange,PQ-val,QuantSig,PEP,MassErrorPPM
METFLFTSESVNEGHP,nta,M,1,false,"Arabidopsis translation initiation landscape - NTA",167a,35069635,,,,,,,,
LCDQISDAVLDACLEQDPDSK,ox,C,20,false,"SPEAR - 10 mM H2O2 / mock",138a,34619326,,,,3.2917531,0.0161047,YES,,
VACETCTK,ox,C,42,false,"OxiTRAQ Arabidopsis - 5 mM H2O2 versus control",47,24376095,,,,0.2327949,0.2064802,NO,,
VACETCTK,so,C,42,false,"S-sulfenylation site detection using YAP1C",110,32714340,,,,,,,,
VACETCTK,ox,C,45,false,"OxiTRAQ Arabidopsis - 5 mM H2O2 versus control",47,24376095,,,,0.2327949,0.2064802,NO,,
VACETCTK,so,C,45,false,"S-sulfenylation site detection using YAP1C",110,32714340,,,,,,,,
VDYEKIVR,ub,K,67,false,"upl3 mutant / wildtype",168,35926874,"MaxQuant score",79.4740000,1.0000000,0.0703893,0.8091800,NO,0.028420299291611,2.4535000
IVRDTCR,so,C,73,false,"S-sulfenylation site detection using YAP1C",110,32714340,,,,,,,,
AIGFVSDDVGLDADKCK,acy,C,90,true,"Arabidopsis S-acylation atlas - Meristem",163a,35681017,,,,,,,,
AIGFVSDDVGLDADKCK,acy,C,90,true,"Arabidopsis S-acylation atlas - Silique",163e,35681017,,,,,,,,
AIGFVSDDVGLDADKCK,ox,C,90,true,"SPEAR - 10 mM H2O2 / mock",138a,34619326,,,,-1.6148831,0.0253549,YES,,
AIGFVSDDVGLDADKCK,ox,C,90,true,"SPEAR - 50 mM H2O2 / mock",138b,34619326,,,,-1.2378495,0.0326189,YES,,
AIGFVSDDVGLDADKCK,sno,C,90,true,"Site-specific nitrosomeproteomic id - gsnor1-3",90a,25699590,XCorr,3.2210867,,,,,7.9489997006021E-5,-5.0819895
AIGFVSDDVGLDADKCK,sno,C,90,true,"Site-specific nitrosomeproteomic id - gsnor1-3",90b,25699590,XCorr,2.7700000,,,,,0.0025549998972565,-6.6300000
AIGFVSDDVGLDADKCK,so,C,90,true,"Arabidopsis S-sulfenylation chemoproteomics",108,31578252,"pFind PSM Score",0.0062610,,1.1650300,,,,-1.6026680
AIGFVSDDVGLDADKCK,so,C,90,true,"S-sulfenylation site detection using YAP1C",110,32714340,,,,,,,,
QQSPDIAQGVHGHFTKCPEE,nt,Q,98,true,"HUNTER N-terminome: legumain, GluC and trypsin",119,31951383,"MaxQuant score",41.2920000,,,,,,
VLVNIEQQSPDIAQGVHGHFTK,ph,S,100,false,"TOR Kinase and ABA Receptor",100,29290610,XCorr,3.5522261,1.0000000,,,,0.00063969998154789,
VLVNIEQQSPDIAQGVHGHFTK,ph,S,100,false,"Tissue atlas Arabidopsis - ProteomicsDB",114,32188942,"MaxQuant score",207.0700000,1.0000000,,,,0,
QGHMFGYATD,nt,Q,123,false,"HUNTER N-terminome: legumain, GluC and trypsin",119,31951383,"MaxQuant score",94.3020000,,,,,,
NGTCAWLRPDGK,so,C,161,true,"Arabidopsis S-sulfenylation chemoproteomics",108,31578252,"pFind PSM Score",0.0183292,,1.1532400,,,,-1.0202988
NGTCAWLRPDGK,so,C,161,true,"S-sulfenylation site detection using YAP1C",110,32714340,,,,,,,,
TQVTVEYYNDKGAMVPIR,ub,K,180,true,"upl3 mutant / wildtype",168,35926874,"MaxQuant score",111.7800000,1.0000000,0.0271541,0.9700800,NO,7.7997198977275E-11,-0.8280900
TVLISTQHDETVTNDEIAR,nt,T,190,false,"Arg/N-end rule pathway Roots",80,25728785,"MASCOT Score",43.2100000,,,,,8.3499999163905E-6,
TVLISTQHDETVTNDEIAR,nt,T,190,false,"FtsH12 N-terminome: WT / FtsH12 knockdown miRNA",118,33216923,"MaxQuant score",57.5950000,,2.3103285,0.0029020,YES,0.023298000916839,
TVLISTQHDE,nt,T,190,false,"Arg/N-end rule seed, prt6 vs. Wt",99,29168982,"MASCOT Score",54.0500000,,-0.5186696,0.1607478,NO,0.0010710000060499,-1.5319662
STQHDETVTNDEIAR,nt,S,194,false,"Arg/N-end rule seed, prt6 vs. Wt",99,29168982,"MASCOT Score",23.5900000,,0.6371221,0.2530208,NO,0.027969999238849,-0.0073142
TQHDETVTNDEIAR,nt,T,195,false,"Arg/N-end rule seed, prt6 vs. Wt",99,29168982,"MASCOT Score",30.0900000,,-0.3290568,0.4129225,NO,0.027219999581575,-1.7888810
DLKEHVIKPVIPEK,ub,K,211,false,"upl3 mutant / wildtype",168,35926874,"MaxQuant score",77.4200000,1.0000000,0.2448871,0.7671400,NO,6.5008200181182E-5,0.0683500
EHVIKPVIPEKYLDEK,ub,K,222,false,"upl3 mutant / wildtype",168,35926874,"MaxQuant score",75.3160000,0.9960000,-0.6104332,0.0471610,YES,3.9884500438347E-5,-0.4995800
YLDEKTIFHLNPSGR,ac,K,227,false,"Histone deacetylases - apicidin vs control",98a,29061669,"MaxQuant Score",125.5000000,1.0000000,0.3770000,0.0512861,NO,9.7000003515535E-12,
YLDEKTIFHLNPSGR,ac,K,227,false,"Histone deacetylases substrates - hda14 vs WT",98e,29061669,"MaxQuant Score",140.2000000,1.0000000,-0.0450000,0.9289664,NO,1.4999999552573E-35,
YLDEKTIFHLNPSGR,cr,K,227,false,"Open search Plant PTM Viewer 2.0 - Crotonylation",164c,TBA,,,,,,,,
YLDEKTIFHLNPSGR,ub,K,227,false,"upl3 mutant / wildtype",168,35926874,"MaxQuant score",194.5800000,1.0000000,0.8773516,0.3034000,NO,1.6326499343091E-29,-0.6655000
TIFHLNPSGR,ph,S,235,false,"atm and atr DNA damage response",88,25561503,"MASCOT Score",47.0000000,1.0000000,,,,,-0.3400000
TIFHLNPSGR,ph,S,235,false,"Lateral root-induction - NAA vs control",106,23328941,"MASCOT Score",21.0000000,,,,,,
TIFHLNPSGR,ph,S,235,false,"Phospho cell culture sucrose/TOR",109,30833711,,,0.9999870,,,,,
TIFHLNPSGR,ph,S,235,false,"Tissue atlas Arabidopsis - ProteomicsDB",114,32188942,"MaxQuant score",129.0400000,1.0000000,,,,4.5313401642488E-5,
GPHGDAGLTGR,nt,G,242,false,"Arg/N-end rule seed, prt6 vs. Wt",99,29168982,"MASCOT Score",47.6500000,,,,,0.01429000031203,-1.1621444
SGKDPTKVDRSGAY,nt,S,271,false,"Arabidopsis translation initiation landscape - NT",167b,35069635,,,,,,,,
DPTKVDR,ac,K,277,false,"Quantitative Acetylproteomics",101,29440448,,,,,,,,
SGAYIVR,nt,S,281,false,"Arabidopsis translation initiation landscape - NT",167b,35069635,,,,,,,,
QAAKSVVANGMAR,ac,K,291,false,"Quantitative Acetylproteomics",101,29440448,,,,,,,,
QAAKSVVANGMAR,ub,K,291,false,"Arabidopsis ubiquitination COFRADIC",40,26744219,"MaxQuant Score",80.3120000,1.0000000,,,,8.2619999730582E-9,-0.5990000
KTAAYGHFGRD,nt,K,364,false,"Arabidopsis translation initiation landscape - NT",167b,35069635,,,,,,,,
FLKTAAYGHFGR,ub,K,364,false,"upl3 mutant / wildtype",168,35926874,"MaxQuant score",96.1130000,1.0000000,0.2302030,0.5805600,NO,7.297309639398E-5,-0.0797960
TAAYGHFGRD,nt,T,365,false,"Arabidopsis translation initiation landscape - NT",167b,35069635,,,,,,,,
DDPDFTWEVVKPLKWDKPQA,ub,K,387,false,"upl3 mutant / wildtype",168,35926874,"MaxQuant score",118.0200000,0.9640000,-0.3327891,0.3809200,NO,1.6201800101187E-12,0.5800500
DDPDFTWEVVKPLKWDKPQA,ub,K,390,false,"upl3 mutant / wildtype",168,35926874,"MaxQuant score",118.0200000,0.9990000,-0.3327891,0.3809200,NO,1.6201800101187E-12,0.5800500
