Peptide,PTM,ModifiedAA,ModifiedPosition,PeptideUniqueToGene,ExperimentDesc,ExpID,PubmedID,ScoreType,IdentScore,LocProb,Log2FChange,PQ-val,QuantSig,PEP,MassErrorPPM
KRSFEEEEEDNDVNK,ph,S,11,true,"STN8 phosphoproteome",38,21768351,"MASCOT Score",59.0900000,,,,,,-0.8651680
KRSFEEEEEDNDVNK,ph,S,11,true,"TOR Kinase and ABA Receptor",100,29290610,XCorr,4.7973080,1.0000000,,,,3.0480000532407E-6,
SFEEEEEDNDVNK,ph,S,11,true,"Tissue atlas Arabidopsis - ProteomicsDB",114,32188942,"MaxQuant score",201.4800000,1.0000000,,,,2.8025969286496E-45,
AAISEEEEKRR,ph,S,27,true,"Tissue atlas Arabidopsis - ProteomicsDB",114,32188942,"MaxQuant score",68.2770000,1.0000000,,,,0.0026335900183767,
AAISEEEEK,ph,S,27,true,"atm and atr DNA damage response",88,25561503,"MASCOT Score",51.0000000,1.0000000,,,,,-0.4700000
SFEEEEEDNDVNKAAISEEEEKR,ub,K,32,true,"Arabidopsis ubiquitination COFRADIC",40,26744219,"MaxQuant Score",111.3800000,1.0000000,,,,0,0.2670000
KLGIPALSSTAQSSIGK,ph,S,63,true,"Tissue atlas Arabidopsis - ProteomicsDB",114,32188942,"MaxQuant score",64.1840000,0.8713610,,,,0.00013352899986785,
NIDDAEEVENELKR,me1,K,128,true,"Arabidopsis protein methylome",123,31809900,"MaxQuant Score",239.6100000,1.0000000,,,,0,-1.3097000
NIDDAEEVENELKR,me2,K,128,true,"Arabidopsis protein methylome",123,31809900,"MaxQuant Score",232.1700000,1.0000000,,,,0,-0.5577500
NIDDAEEVENELKR,ub,K,128,true,"Arabidopsis ubiquitination COFRADIC",40,26744219,"MaxQuant Score",161.0400000,1.0000000,,,,0,-0.1340000
GKDYAEKLR,ub,K,216,true,"Arabidopsis ubiquitination COFRADIC",40,26744219,"MaxQuant Score",96.3420000,1.0000000,,,,0.0010000000474975,0.1320000
EHPELYKDR,ub,K,226,true,"Arabidopsis ubiquitination COFRADIC",40,26744219,"MaxQuant Score",86.8980000,1.0000000,,,,0.000538999971468,-0.4440000
