Peptide,PTM,ModifiedAA,ModifiedPosition,PeptideUniqueToGene,ExperimentDesc,ExpID,PubmedID,ScoreType,IdentScore,LocProb,Log2FChange,PQ-val,QuantSig,PEP,MassErrorPPM
SISQVYGYGTVDYER,nt,S,46,true,"N-terminal ChaFRADIC",92,26010716,"MASCOT Score",60.1200000,,,,,3.8469999708468E-5,
SISQVYGYGTVDYER,nt,S,46,true,"HUNTER N-terminome: legumain, GluC and trypsin",119,31951383,"MaxQuant score",156.8100000,,,,,,
SISQVYGYGTVDYE,nt,S,46,true,"N-terminal ChaFRADIC",92,26010716,"MASCOT Score",46.6600000,,,,,1.4160000318952E-5,
SISQVYGYGTVD,nt,S,46,true,"HUNTER N-terminome: legumain, GluC and trypsin",119,31951383,"MaxQuant score",99.2830000,,,,,,
SISQVYGYGTVDYER,nta,S,46,true,"N-terminal ChaFRADIC",92,26010716,"MASCOT Score",60.1200000,,,,,3.8469999708468E-5,
SISQVYGYGTVDYER,nta,S,46,true,"FtsH12 N-terminome: WT / FtsH12 knockdown miRNA",118,33216923,"MaxQuant score",80.7630000,,,,,0.00019752999651246,
SISQVYGYGTVDYER,nta,S,46,true,"HUNTER N-terminome: legumain, GluC and trypsin",119,31951383,"MaxQuant score",56.9510000,,,,,,
SISQVYGYGTVD,nta,S,46,true,"HUNTER N-terminome: legumain, GluC and trypsin",119,31951383,"MaxQuant score",112.1300000,,,,,,
LCEEESDVTSK,sno,C,464,true,"Site-specific nitrosomeproteomic id - gsnor1-3",90a,25699590,XCorr,3.5263977,,,,,2.6440000510775E-5,-6.4784042
LCEEESDVTSK,sno,C,464,true,"Site-specific nitrosomeproteomic id - gsnor1-3",90b,25699590,XCorr,3.7200000,,,,,0.037030000239611,-7.2700000
EAVLELLR,nt,E,474,true,"Metacaspase9 substrates - 35S:MC9 / mc9",51b,23964026,"MASCOT Score",45.0000000,,,,,,0.9846311
QSGDLEDKSYLALIDVDENR,nt,Q,482,true,"HUNTER N-terminome: legumain, GluC and trypsin",119,31951383,"MaxQuant score",42.7110000,,,,,,
