Peptide,PTM,ModifiedAA,ModifiedPosition,PeptideUniqueToGene,ExperimentDesc,ExpID,PubmedID,ScoreType,IdentScore,LocProb,Log2FChange,PQ-val,QuantSig,PEP,MassErrorPPM
VPSSHSPEPPPPPIR,ph,S,88,true,"Phosphorylation Early Elicitor Signaling",23,17317660,,,,,,,,
VPSSHSPEPPPPPIR,ph,S,88,true,"atm and atr DNA damage response",88,25561503,"MASCOT Score",37.0000000,1.0000000,,,,,-0.2400000
VPSSHSPEPPPPPIR,ph,S,88,true,"Tissue atlas Arabidopsis - ProteomicsDB",114,32188942,"MaxQuant score",146.2600000,0.9996110,,,,1.5833899524864E-8,
RLPHILSDSSPSSSPATSFYPTAHQNSTYSR,ph,S,116,true,"TOR Kinase and ABA Receptor",100,29290610,XCorr,3.9603479,0.7539000,,,,0.00044689999776892,
RLPHILSDSSPSSSPATSFYPTAHQNSTYSR,ph,S,116,true,"Tissue atlas Arabidopsis - ProteomicsDB",114,32188942,"MaxQuant score",180.7500000,0.9738300,,,,0,
RLPHILSDSSPSSSPATSFYPTAHQNSTYSR,ph,S,120,true,"Tissue atlas Arabidopsis - ProteomicsDB",114,32188942,"MaxQuant score",171.2100000,0.9136720,,,,0,
HRPPSDYDAETER,ph,S,176,true,"atm and atr DNA damage response",88,25561503,"MASCOT Score",55.0000000,0.9970000,,,,,-0.2000000
AELDRSFSK,ph,S,307,true,"Tissue atlas Arabidopsis - ProteomicsDB",114,32188942,"MaxQuant score",96.0670000,0.9934700,,,,0.0028055000584573,
YYQAYSTVGIGPGPEVLDSRDPLSEK,ph,S,617,true,"TOR Kinase and ABA Receptor",100,29290610,XCorr,3.3445966,0.7692000,,,,9.7600001026876E-5,
