Peptide,PTM,ModifiedAA,ModifiedPosition,PeptideUniqueToGene,ExperimentDesc,ExpID,PubmedID,ScoreType,IdentScore,LocProb,Log2FChange,PQ-val,QuantSig,PEP,MassErrorPPM
MDIEQKQAEIIDQLVKR,nta,M,1,true,"Arg/N-end rule pathway Roots",80,25728785,"MASCOT Score",52.9900000,,,,,5.9109999028806E-7,
MDIEQKQAEIIDQLVKR,nta,M,1,true,"N-terminal ChaFRADIC",92,26010716,"MASCOT Score",32.0800000,,,,,4.9620000936557E-5,
MDIEQKQAEIIDQLVKR,nta,M,1,true,"Stromal N-terminome",96,26371235,"MASCOT Score",45.4800000,,,,,,
MDIEQKQAEIIDQLVKR,nta,M,1,true,"Arabidopsis translation initiation landscape - NTA",167a,35069635,,,,,,,,
MDIEQKQAE,nta,M,1,true,"N-terminal ChaFRADIC",92,26010716,"MASCOT Score",32.9400000,,,,,0.059879999607801,
VLPYDTLMVELDVSNVR,ph,T,114,true,"Phosphorylation in N starvation",63,22060019,"MASCOT Score",24.0000000,,,,,,-3.0383700
VLPYDTLMVELDVSNVR,ph,S,122,true,"Phosphorylation in N starvation",63,22060019,"MASCOT Score",24.0000000,,,,,,-3.0383700
GKLDQLKR,ac,K,149,true,"Quantitative Acetylproteomics",101,29440448,,,,,,,,
CFEVPFAAGR,so,C,151,true,"S-sulfenylation site detection using YAP1C",110,32714340,,,,,,,,
SLSMKGDVDIR,ph,S,221,true,"Tissue atlas Arabidopsis - ProteomicsDB",114,32188942,"MaxQuant score",86.7380000,0.9998440,,,,0.00042814199696295,
