Peptide,PTM,ModifiedAA,ModifiedPosition,PeptideUniqueToGene,ExperimentDesc,ExpID,PubmedID,ScoreType,IdentScore,LocProb,Log2FChange,PQ-val,QuantSig,PEP,MassErrorPPM
RPLSPSSAVVETSATEER,ph,S,111,true,"STN8 phosphoproteome",38,21768351,"MASCOT Score",52.8000000,,,,,,-0.3066600
RPLSPSSAVVETSATEER,ph,S,111,true,"atm and atr DNA damage response",88,25561503,"MASCOT Score",63.0000000,0.9980000,,,,,0.0500000
RPLSPSSAVVETSATEER,ph,S,111,true,"TOR Kinase and ABA Receptor",100,29290610,XCorr,4.5839896,0.9855000,,,,1.8109999473381E-6,
RPLSPSSAVVETSATEER,ph,S,111,true,"Lateral root-induction - NAA vs control",106,23328941,"MASCOT Score",34.0000000,,,,,,
RPLSPSSAVVETSATEER,ph,S,111,true,"Phospho cell culture sucrose/TOR",109,30833711,,,0.9175740,,,,,
RPLSPSSAVVETSATEER,ph,S,111,true,"Col-0 callus - FC Col-0 vs. Col-0 Xray",111a,31410901,,68.8100000,,-1.3253117,0.0171333,YES,,1.0551219
RPLSPSSAVVETSATEER,ph,S,111,true,"Col-0 X-ray callus - FC Col-0 vs. Col-0 Xray",111b,31410901,,68.8100000,,-1.3253117,0.0171333,YES,,1.0551219
RPLSPSSAVVETSATEER,ph,S,111,true,"atm callus - FC atm vs. atm Xray",111c,31410901,,68.8100000,,1.5291523,0.2595066,NO,,1.0551219
RPLSPSSAVVETSATEER,ph,S,111,true,"atm-3 X-ray callus - FC atm vs. atm Xray",111d,31410901,,68.8100000,,1.5291523,0.2595066,NO,,1.0551219
PLSPSSAVVETSATEER,ph,S,111,true,"Tissue atlas Arabidopsis - ProteomicsDB",114,32188942,"MaxQuant score",159.8600000,0.9432560,,,,2.4223999270333E-29,
LKRPLSPSSAVVETSATEER,ph,S,113,true,"SnRK2 protein kinase substrates",85,23776212,XCorr,3.5054767,0.8530000,,,,0.0064965197816491,
RPLSPSSAVVETSATEER,ph,S,113,true,"srk2dei ABA signaling phopshoproteomics",83,23572148,"MASCOT Score",40.0000000,,,,,,0.0027000
RPLSPSSAVVETSATEER,ph,S,113,true,"Tissue atlas Arabidopsis - ProteomicsDB",114,32188942,"MaxQuant score",162.2900000,0.8723480,,,,2.7532699620634E-22,
RPLSPSSAVVETSATEER,ph,S,114,true,"srk2dei ABA signaling phopshoproteomics",83,23572148,"MASCOT Score",56.0000000,,,,,,0.0012000
RPLSPSSAVVETSATEER,ph,S,114,true,"Col-0 callus - FC Col-0 vs. Col-0 Xray",111a,31410901,,29.4600000,,-1.2639465,0.0256656,YES,,0.4663531
RPLSPSSAVVETSATEER,ph,S,114,true,"Col-0 X-ray callus - FC Col-0 vs. Col-0 Xray",111b,31410901,,29.4600000,,-1.2639465,0.0256656,YES,,0.4663531
RPLSPSSAVVETSATEER,ph,S,114,true,"atm callus - FC atm vs. atm Xray",111c,31410901,,29.4600000,,-0.6446354,0.2559400,NO,,0.4663531
RPLSPSSAVVETSATEER,ph,S,114,true,"atm-3 X-ray callus - FC atm vs. atm Xray",111d,31410901,,29.4600000,,-0.6446354,0.2559400,NO,,0.4663531
