Peptide,PTM,ModifiedAA,ModifiedPosition,PeptideUniqueToGene,ExperimentDesc,ExpID,PubmedID,ScoreType,IdentScore,LocProb,Log2FChange,PQ-val,QuantSig,PEP,MassErrorPPM
ADPRVAVVTGSNKGIGFE,nt,A,2,true,"Arg/N-end rule seed, prt6 vs. Wt",99,29168982,"MASCOT Score",29.3100000,,,,,1.3280000432658E-9,-1.0963435
ADPRVAVVTGSNKGIGFE,nta,A,2,true,"Arg/N-end rule seed, prt6 vs. Wt",99,29168982,"MASCOT Score",29.3100000,,-0.0643996,0.5871268,NO,1.3280000432658E-9,-1.0963435
ADPRVAVVTGSNKGIGFE,nta,A,2,true,"HUNTER N-terminome: legumain, GluC and trypsin",119,31951383,"MaxQuant score",,,,,,,
ADPRVAVVTGSNKGIGFE,nta,A,2,true,"Arabidopsis translation initiation landscape - NTA",167a,35069635,,,,,,,,
ADPRVAVVTGSN,nta,A,2,true,"HUNTER N-terminome: legumain, GluC and trypsin",119,31951383,"MaxQuant score",150.4600000,,,,,,
GIGFEICR,so,C,21,false,"Arabidopsis S-sulfenylation chemoproteomics",108,31578252,"pFind PSM Score",0.0672720,,0.8474600,,,,-1.3888684
GIGFEICR,so,C,21,false,"S-sulfenylation site detection using YAP1C",110,32714340,,,,,,,,
QLANNGITVVLTAR,nt,Q,23,true,"HUNTER N-terminome: legumain, GluC and trypsin",119,31951383,"MaxQuant score",160.8600000,,,,,,
IMSDTYEIVEECVK,sno,C,132,true,"Site-specific nitrosomeproteomic id - gsnor1-3",90a,25699590,XCorr,2.2577682,,,,,0.00023079999664333,-6.0764986
IMSDTYEIVEECVK,sno,C,132,true,"Site-specific nitrosomeproteomic id - gsnor1-3",90b,25699590,XCorr,3.0900000,,,,,6.6430002334528E-5,-6.8900000
IMSDTYEIVEECVK,so,C,132,true,"Arabidopsis S-sulfenylation chemoproteomics",108,31578252,"pFind PSM Score",0.2788090,,,,,,-1.3478980
IMSDTYEIVEECVK,so,C,132,true,"S-sulfenylation site detection using YAP1C",110,32714340,,,,,,,,
LENVSNEWAK,ng,N,171,true,"Conserved N-glycosylation",74,22633491,"MaxQuant Score",69.5120000,0.9990000,,,,0.016000000759959,-3.9450000
GVLSDAENLTEEK,ph,S,182,true,"Tissue atlas Arabidopsis - ProteomicsDB",114,32188942,"MaxQuant score",159.5200000,1.0000000,,,,4.4708600710486E-10,
SFIINSVCPGFVNTEINFNTGILSVEEGAASPVK,so,C,247,true,"S-sulfenylation site detection using YAP1C",110,32714340,,,,,,,,
