Peptide,PTM,ModifiedAA,ModifiedPosition,PeptideUniqueToGene,ExperimentDesc,ExpID,PubmedID,ScoreType,IdentScore,LocProb,Log2FChange,PQ-val,QuantSig,PEP,MassErrorPPM
IGESSESSDETEATDLKDAR,ph,S,120,true,"SnRK2 protein kinase substrates",85,23776212,XCorr,4.7124853,0.9100000,,,,0.00013859999307897,
IGESSESSDETEATDLK,ph,S,120,true,"srk2dei ABA signaling phopshoproteomics",83,23572148,"MASCOT Score",98.0000000,,,,,,-0.0007000
IGESSESSDETEATDLK,ph,S,120,true,"LAXIC - ABA stress",84a,23660473,XCorr,6.3600000,0.9410000,,,,0.00049975997535512,
IGESSESSDETEATDLK,ph,S,120,true,"LAXIC - mannitol vs control",84b,23660473,XCorr,5.7200000,0.9330000,-1.4023405,,NO,5.7499999206456E-10,
IGESSESSDETEATDLK,ph,S,120,true,"SnRK2 protein kinase substrates",85,23776212,XCorr,5.4453278,0.9610000,,,,6.0386398104129E-9,
IGESSESSDETEATDLK,ph,S,120,true,"atm and atr DNA damage response",88,25561503,"MASCOT Score",98.0000000,0.9390000,,,,,-0.3200000
IGESSESSDETEATDLK,ph,S,120,true,"TOR Kinase and ABA Receptor",100,29290610,XCorr,6.1635437,0.9285000,,,,1.028999996322E-9,
IGESSESSDETEATDLK,ph,S,120,true,"Lateral root-induction - NAA vs control",106,23328941,"MASCOT Score",38.0000000,,,,,,
IGESSESSDETEATDLK,ph,S,120,true,"Tissue atlas Arabidopsis - ProteomicsDB",114,32188942,"MaxQuant score",478.3200000,0.9997620,,,,0,
IGESSESSDETEATDLK,ph,S,121,true,"Large-scale phosphorylation discovery",44,23111157,XCorr,3.3350000,,,,,,
LNSTMFEEKAQR,ac,K,168,false,"Histone deacetylases - apicidin vs control",98a,29061669,"MaxQuant Score",182.3000000,1.0000000,-0.1180000,0.4931738,NO,0,
LNSTMFEEKAQR,ac,K,168,false,"Histone deacetylases substrates - TSA vs control",98b,29061669,"MaxQuant Score",182.3000000,1.0000000,0.0270000,0.9977001,NO,0,
LNSTMFEEKAQR,ac,K,168,false,"Histone deacetylases- hda14 vs WT (low light)",98c,29061669,"MaxQuant Score",210.9100000,1.0000000,-2.0420000,0.9885531,NO,3.8999998870923E-16,
LNSTMFEEKAQR,ac,K,168,false,"Histone deacetylases - hda14 vs WT (thylakoids)",98d,29061669,"MaxQuant Score",72.9000000,1.0000000,-0.1760000,0.8892011,NO,0.0010000000474975,
LNSTMFEEKAQR,ac,K,168,false,"Histone deacetylases substrates - hda14 vs WT",98e,29061669,"MaxQuant Score",171.0000000,1.0000000,-0.0930000,0.9099133,NO,0,
LNSTMFEEKAQR,ac,K,168,false,"Quantitative Acetylproteomics",101,29440448,,,,,,,,
SLSISQTPEETQGQLSDEETSQEDAMVLSGNVEDVTHQVEK,ph,S,365,true,"STN8 phosphoproteome",38,21768351,"MASCOT Score",64.4000000,,,,,,
SLSISQTPEETQGQLSDEETSQEDAMVLSGNVEDVTHQVEK,ph,S,365,true,"Chloroplast kinase substrates",60,19376835,"MASCOT Score",45.7100000,,,,,,-1.1203300
EGSSLNSPK,ph,S,472,true,"atm and atr DNA damage response",88,25561503,"MASCOT Score",40.0000000,1.0000000,,,,,-0.9300000
EGSSLNSPKASFNKSSR,ph,S,476,true,"Chloroplast kinase substrates",60,19376835,"MASCOT Score",35.7300000,,,,,,0.4564130
ASFNKSSR,ac,K,479,true,"Quantitative Acetylproteomics",101,29440448,,,,,,,,
CVWALSK,ox,C,1076,false,"SPEAR - 10 mM H2O2 / mock",138a,34619326,,,,3.5986732,0.0083200,YES,,
CVWALSK,ox,C,1076,false,"SPEAR - 50 mM H2O2 / mock",138b,34619326,,,,3.3868510,0.0228446,YES,,
