Peptide,PTM,ModifiedAA,ModifiedPosition,PeptideUniqueToGene,ExperimentDesc,ExpID,PubmedID,ScoreType,IdentScore,LocProb,Log2FChange,PQ-val,QuantSig,PEP,MassErrorPPM
SFTGTLDKCNVCDKTVY,nt,S,2,true,"Arg/N-end rule seed, prt6 vs. Wt",99,29168982,"MASCOT Score",21.7600000,,,,,0.0034370000939816,-3.9334184
SFTGTLDKCNVCDKTVY,nta,S,2,true,"Arg/N-end rule pathway Roots",80,25728785,"MASCOT Score",42.8000000,,,,,0.0012959999730811,
SFTGTLDKCNVCDKTVY,nta,S,2,true,"Arg/N-end rule seed, prt6 vs. Wt",99,29168982,"MASCOT Score",21.7600000,,-0.4348518,0.0653104,NO,0.0034370000939816,-3.9334184
SFTGTLDK,ph,S,2,false,"Tissue atlas Arabidopsis - ProteomicsDB",114,32188942,"MaxQuant score",77.5330000,0.9750560,,,,0.016669400036335,
THFEQLFKESGNFSK,ph,S,69,false,"Tissue atlas Arabidopsis - ProteomicsDB",114,32188942,"MaxQuant score",221.8500000,0.9972140,,,,0,
ESGNFSKNFQPGK,ph,S,73,true,"Tissue atlas Arabidopsis - ProteomicsDB",114,32188942,"MaxQuant score",126.9600000,0.9999740,,,,0.00012225599493831,
NFQPGKTEKPELTR,ph,T,81,true,"Tissue atlas Arabidopsis - ProteomicsDB",114,32188942,"MaxQuant score",50.0530000,0.9842610,,,,0.0076056700199842,
TEKPELTRTPSK,ph,T,87,true,"Tissue atlas Arabidopsis - ProteomicsDB",114,32188942,"MaxQuant score",172.8200000,0.9181630,,,,3.8665398092747E-15,
TPSKISSIFCGTQDK,ph,T,89,true,"Tissue atlas Arabidopsis - ProteomicsDB",114,32188942,"MaxQuant score",188.8500000,1.0000000,,,,5.1451199556295E-21,
TPSKISSIFCGTQDK,ph,S,91,true,"Phosphoproteome iron-deficient Arabidopsis roots",41,22438062,"MASCOT Score",37.9800000,,,,,,
TPSKISSIFCGTQDK,ph,S,91,true,"Tissue atlas Arabidopsis - ProteomicsDB",114,32188942,"MaxQuant score",249.8900000,0.9999980,,,,0,
TPSKISSIFCGTQDK,ph,S,94,true,"Tissue atlas Arabidopsis - ProteomicsDB",114,32188942,"MaxQuant score",210.1200000,0.8868250,,,,2.8025969286496E-45,
ISSIFCGTQDK,ph,S,95,true,"Tissue atlas Arabidopsis - ProteomicsDB",114,32188942,"MaxQuant score",137.6000000,0.9998670,,,,1.5749700423839E-6,
CAACEKTVYPLEK,ph,T,110,true,"Tissue atlas Arabidopsis - ProteomicsDB",114,32188942,"MaxQuant score",94.1190000,0.9967320,,,,0.001514230039902,
KTVYPLEK,ph,T,110,false,"Tissue atlas Arabidopsis - ProteomicsDB",114,32188942,"MaxQuant score",124.6000000,0.9999990,,,,0.007013029884547,
RTASGNTLPPEPTEDVAVEAK,ph,T,178,true,"TOR Kinase and ABA Receptor",100,29290610,XCorr,3.4778996,0.8370000,,,,0.00012599999899976,
TASGNTLPPEPTEDVAVEAK,ph,T,178,true,"Large-scale phosphorylation discovery",44,23111157,XCorr,3.2820000,,,,,,
TASGNTLPPEPTEDVAVEAK,ph,S,180,true,"Tissue atlas Arabidopsis - ProteomicsDB",114,32188942,"MaxQuant score",258.8300000,0.9633470,,,,0,
TASGNTLPPEPTEDVAVEAK,ph,T,183,true,"Tissue atlas Arabidopsis - ProteomicsDB",114,32188942,"MaxQuant score",82.3600000,0.9990170,,,,5.1318497753527E-6,
