Peptide,PTM,ModifiedAA,ModifiedPosition,PeptideUniqueToGene,ExperimentDesc,ExpID,PubmedID,ScoreType,IdentScore,LocProb,Log2FChange,PQ-val,QuantSig,PEP,MassErrorPPM
VLFDEECNPR,acy,C,190,false,"Arabidopsis S-acylation atlas - Meristem",163a,35681017,,,,,,,,
DGKSYSTNLAFTPPEYLR,ph,S,208,false,"Tissue atlas Arabidopsis - ProteomicsDB",114,32188942,"MaxQuant score",83.4180000,0.9995560,,,,0.00021839499822818,
DGKSYSTNLAFTPPEYLR,ph,Y,209,false,"Large-scale phosphorylation discovery",44,23111157,XCorr,3.2890000,,,,,,
SYSTNLAFTPPEYLR,ph,S,210,false,"Arabidopsis root NAA phosphoproteome",18a,27643528,"MaxQuant Score",87.6680000,0.8830000,,,,1.0880000012037E-8,0.2420000
SYSTNLAFTPPEYLR,ph,S,210,false,"Sucrose-induced phosphorylation",24,17586839,,,,,,,,
SYSTNLAFTPPEYLR,ph,S,210,false,"Plasmembrane Ph Immune Responses",25,17651370,,,,,,,,
SYSTNLAFTPPEYLR,ph,S,210,false,"Brassinosteroid-Regulated Phosphorylation Dynamics",94,26187819,"MaxQuant Score",150.2300000,0.9630000,,,,5.0109997531619E-13,0.8510000
SYSTNLAFTPPEYLR,ph,S,210,false,"Phospho cell culture sucrose/TOR",109,30833711,,,0.8286590,,,,,
SYSTNLAFTPPEYLR,ph,S,210,false,"Tissue atlas Arabidopsis - ProteomicsDB",114,32188942,"MaxQuant score",305.2900000,0.9997530,,,,0,
CLQYEAR,sno,C,289,false,"hot5-4 / wildtype, FAT-switch S-nitrosoproteome",169,37277371,,,,,,,,
