Peptide,PTM,ModifiedAA,ModifiedPosition,PeptideUniqueToGene,ExperimentDesc,ExpID,PubmedID,ScoreType,IdentScore,LocProb,Log2FChange,PQ-val,QuantSig,PEP,MassErrorPPM
MEKSTSPATR,nta,M,1,true,"Arg/N-end rule pathway Roots",80,25728785,"MASCOT Score",35.4400000,,,,,0.059429999440908,
MEKSTSPATR,nta,M,1,true,"Arg/N-end rule seed, prt6 vs. Wt",99,29168982,"MASCOT Score",24.2900000,,-0.0959896,0.3890155,NO,0.061099998652935,-0.1075889
MEKSTSPATR,nta,M,1,true,"Arabidopsis translation initiation landscape - NTA",167a,35069635,,,,,,,,
MEKSTSPATR,ub,K,3,true,"Arabidopsis ubiquitination COFRADIC",40,26744219,"MaxQuant Score",62.4660000,1.0000000,,,,0.0020000000949949,-0.2240000
VTEPPPAATSSLPAQAPPLPTSADQR,og,T,12,true,"O-GlcNac Inflorescence Tissue",81,28154133,"MASCOT Score",46.6000000,,,,,,2.7000000
SAELPSPAQPAQMTAPPSTVTTDPSSR,ph,S,42,true,"TOR Kinase and ABA Receptor",100,29290610,XCorr,2.7161369,0.9770000,,,,0.0013670000480488,
DLRPHVLEVLRTPDLR,ph,T,100,true,"Tissue atlas Arabidopsis - ProteomicsDB",114,32188942,"MaxQuant score",117.4000000,1.0000000,,,,7.6829799411371E-8,
LMLQLYEEMIGESPKR,ph,S,130,true,"Tissue atlas Arabidopsis - ProteomicsDB",114,32188942,"MaxQuant score",196.8900000,1.0000000,,,,1.86694994402E-39,
ATTTTTTTTSVLR,og,T,149,true,"O-GlcNac Inflorescence Tissue",81,28154133,"MASCOT Score",26.4000000,,,,,,0.7400000
