Peptide,PTM,ModifiedAA,ModifiedPosition,PeptideUniqueToGene,ExperimentDesc,ExpID,PubmedID,ScoreType,IdentScore,LocProb,Log2FChange,PQ-val,QuantSig,PEP,MassErrorPPM
MEGKEEDVRVGANK,mox,M,1,false,"cat2 Methionine oxidation - 3h stress",62b,25693801,"MASCOT Score",42.0000000,,-0.0604855,,NO,,
MEGKEEDVRVGAN,nta,M,1,false,"HUNTER N-terminome: legumain, GluC and trypsin",119,31951383,"MaxQuant score",123.8600000,,,,,,
MEGKEEDVR,nta,M,1,false,"Arg/N-end rule pathway Roots",80,25728785,"MASCOT Score",41.5000000,,,,,0.0015770000172779,
MEGKEEDVR,nta,M,1,false,"Arg/N-end rule seed, prt6 vs. Wt",99,29168982,"MASCOT Score",39.5400000,,-0.0785900,0.4105038,NO,0.056680001318455,-1.4581782
MEGKEEDVR,nta,M,1,false,"Arabidopsis translation initiation landscape - NTA",167a,35069635,,,,,,,,
MEGKEEDVR,ac,K,4,false,"Histone deacetylases- hda14 vs WT (low light)",98c,29061669,"MaxQuant Score",93.1000000,1.0000000,-0.2600000,0.9885531,NO,0.0060000000521541,
MEGKEEDVR,ub,K,4,false,"upl3 mutant / wildtype",168,35926874,"MaxQuant score",87.8060000,1.0000000,0.1712068,0.6620800,NO,0.0014833400491625,-0.5113500
VGANKFPER,ac,K,14,false,"Histone deacetylases substrates - hda14 vs WT",98e,29061669,"MaxQuant Score",93.6000000,1.0000000,0.0340000,0.9705100,NO,0.00039999998989515,
VGANKFPER,ac,K,14,false,"Quantitative Acetylproteomics",101,29440448,,,,,,,,
VGANKFPER,ub,K,14,false,"Ubiquitination Membrane Proteins",120,33585938,,,,,,,,
VGANKFPER,ub,K,14,false,"upl3 mutant / wildtype",168,35926874,"MaxQuant score",138.0800000,1.0000000,0.7638365,0.1373000,NO,0.0010815199930221,0.0473800
QPIGTSAQTDKDYKEPPPAPFFEPGELSSWSFYR,nt,Q,19,true,"HUNTER N-terminome: legumain, GluC and trypsin",119,31951383,"MaxQuant score",,,,,,,
QPIGTSAQTDKDYK,ac,K,29,true,"Quantitative Acetylproteomics",101,29440448,,,,,,,,
TIPITGTGINPAR,nt,T,226,false,"Arg/N-end rule seed, prt6 vs. Wt",99,29168982,"MASCOT Score",59.1200000,,,,,0.0047100000083447,-0.2771244
AIPFKSR,ac,K,283,false,"Quantitative Acetylproteomics",101,29440448,,,,,,,,
