Peptide,PTM,ModifiedAA,ModifiedPosition,PeptideUniqueToGene,ExperimentDesc,ExpID,PubmedID,ScoreType,IdentScore,LocProb,Log2FChange,PQ-val,QuantSig,PEP,MassErrorPPM
SKIRSSATMPHR,nta,S,2,true,"Arabidopsis translation initiation landscape - NTA",167a,35069635,,,,,,,,
LAIVESTSR,ph,S,370,true,"Tissue atlas Arabidopsis - ProteomicsDB",114,32188942,"MaxQuant score",119.3400000,0.8064700,,,,0.00030149499070831,
LAIVESTSR,ph,S,372,true,"Tissue atlas Arabidopsis - ProteomicsDB",114,32188942,"MaxQuant score",150.0900000,0.7858940,,,,0.00016625100397505,
QQGESTLTSTEIVR,ph,S,382,true,"Tissue atlas Arabidopsis - ProteomicsDB",114,32188942,"MaxQuant score",207.4000000,0.8266530,,,,3.1150864861941E-42,
EASELKESLSPGQQHVSQNTAVKPEGR,ph,S,391,true,"Tissue atlas Arabidopsis - ProteomicsDB",114,32188942,"MaxQuant score",116.3900000,0.9999950,,,,1.6006599971915E-28,
ESLSPGQQHVSQNTAVKPEGR,ph,S,398,true,"atm and atr DNA damage response",88,25561503,"MASCOT Score",43.0000000,0.9920000,,,,,-0.8400000
ESLSPGQQHVSQNTAVKPEGR,ph,S,398,true,"TOR Kinase and ABA Receptor",100,29290610,XCorr,2.8868494,0.9816000,,,,8.794000314083E-5,
ESLSPGQQHVSQNTAVKPEGR,ph,S,398,true,"Col-0 callus - FC Col-0 vs. Col-0 Xray",111a,31410901,,27.5500000,,0.3692306,0.0000000,NO,,0.7298055
ESLSPGQQHVSQNTAVKPEGR,ph,S,398,true,"Col-0 X-ray callus - FC Col-0 vs. Col-0 Xray",111b,31410901,,27.5500000,,0.3692306,0.0000000,NO,,0.7298055
ESLSPGQQHVSQNTAVKPEGR,ph,S,398,true,"atm callus - FC atm vs. atm Xray",111c,31410901,,27.5500000,,0.8850801,0.0000000,NO,,0.7298055
ESLSPGQQHVSQNTAVKPEGR,ph,S,398,true,"atm-3 X-ray callus - FC atm vs. atm Xray",111d,31410901,,27.5500000,,0.8850801,0.0000000,NO,,0.7298055
ESLSPGQQHVSQNTAVKPEGR,ph,S,398,true,"Tissue atlas Arabidopsis - ProteomicsDB",114,32188942,"MaxQuant score",277.3200000,0.9999870,,,,0,
ESLSPGQQHVSQNTAVKPEGR,ph,T,408,true,"Tissue atlas Arabidopsis - ProteomicsDB",114,32188942,"MaxQuant score",123.2200000,0.9644940,,,,1.3553700098177E-17,
TDGSSGLNEESTSR,ph,S,439,true,"atm and atr DNA damage response",88,25561503,"MASCOT Score",66.0000000,1.0000000,,,,,-0.4400000
TDGSSGLNEESTSR,ph,S,439,true,"Lateral root-induction - NAA vs control",106,23328941,"MASCOT Score",26.0000000,,,,,,
TDGSSGLNEESTSR,ph,S,439,true,"Tissue atlas Arabidopsis - ProteomicsDB",114,32188942,"MaxQuant score",275.4200000,0.9994390,,,,0,
TDGSSGLNEESTSR,ph,S,440,true,"atm and atr DNA damage response",88,25561503,"MASCOT Score",66.0000000,1.0000000,,,,,-0.4400000
TDGSSGLNEESTSR,ph,S,440,true,"Lateral root-induction - NAA vs control",106,23328941,"MASCOT Score",26.0000000,,,,,,
TDGSSGLNEESTSR,ph,S,440,true,"Tissue atlas Arabidopsis - ProteomicsDB",114,32188942,"MaxQuant score",116.5800000,0.9885400,,,,4.8009700549301E-5,
TDGSSGLNEESTSR,ph,S,446,true,"Tissue atlas Arabidopsis - ProteomicsDB",114,32188942,"MaxQuant score",207.6600000,0.7771470,,,,2.9763579382259E-42,
TDGSSGLNEESTSR,ph,T,447,true,"Tissue atlas Arabidopsis - ProteomicsDB",114,32188942,"MaxQuant score",265.4300000,0.7636880,,,,0,
TDGSSGLNEESTSR,ph,S,448,true,"atm and atr DNA damage response",88,25561503,"MASCOT Score",68.0000000,0.9240000,,,,,-0.0800000
RDDIAMSDTEEVLSSSSR,ph,S,456,true,"Conserved plant phosphoproteome - Arabidopsis",61a,20466843,"MASCOT Score",40.0000000,1.0000000,,,,,
RDDIAMSDTEEVLSSSSR,ph,S,456,true,"LAXIC - mannitol vs control",84b,23660473,XCorr,3.1500000,0.7800000,,,,9.0299996372778E-5,
RDDIAMSDTEEVLSSSSR,ph,S,456,true,"SnRK2 protein kinase substrates",85,23776212,XCorr,3.7434635,0.9700000,,,,4.1538199546665E-9,
RDDIAMSDTEEVLSSSSR,ph,S,456,true,"atm and atr DNA damage response",88,25561503,"MASCOT Score",33.0000000,1.0000000,,,,,-0.2900000
RDDIAMSDTEEVLSSSSR,ph,S,456,true,"Tissue atlas Arabidopsis - ProteomicsDB",114,32188942,"MaxQuant score",146.2500000,0.9995700,,,,8.4110798338914E-22,
RDDIAMSDTEEVLSSSSR,ph,S,463,true,"SnRK2 protein kinase substrates",85,23776212,XCorr,3.7434635,0.9680000,,,,4.1538199546665E-9,
RDDIAMSDTEEVLSSSSR,ph,S,463,true,"atm and atr DNA damage response",88,25561503,"MASCOT Score",33.0000000,0.9780000,,,,,-0.2900000
RDDIAMSDTEEVLSSSSR,ph,S,463,true,"Tissue atlas Arabidopsis - ProteomicsDB",114,32188942,"MaxQuant score",132.3300000,0.9507170,,,,8.4110798338914E-22,
RDDIAMSDTEEVLSSSSR,ph,S,466,true,"atm and atr DNA damage response",88,25561503,"MASCOT Score",33.0000000,0.9780000,,,,,-0.2900000
CASPEDSR,ph,S,470,true,"SnRK2 protein kinase substrates",85,23776212,XCorr,2.2150729,1.0000000,,,,0.043150998651981,
CASPEDSR,ph,S,470,true,"atm and atr DNA damage response",88,25561503,"MASCOT Score",39.0000000,1.0000000,,,,,-0.5400000
KTPLEVMQESSPNQLVMSSK,ph,S,487,true,"Tissue atlas Arabidopsis - ProteomicsDB",114,32188942,"MaxQuant score",165.8000000,0.8537070,,,,8.2055796748152E-24,
KTPLEVMQESSPNQLVMSSK,ph,S,488,true,"atm and atr DNA damage response",88,25561503,"MASCOT Score",36.0000000,1.0000000,,,,,0.5200000
TPLEVMQESSPNQLVMSSK,ph,S,488,true,"TOR Kinase and ABA Receptor",100,29290610,XCorr,5.1697502,0.9298000,,,,0.00030949999927543,
TPLEVMQESSPNQLVMSSK,ph,S,488,true,"Tissue atlas Arabidopsis - ProteomicsDB",114,32188942,"MaxQuant score",304.0400000,0.9985630,,,,0,
