Peptide,PTM,ModifiedAA,ModifiedPosition,PeptideUniqueToGene,ExperimentDesc,ExpID,PubmedID,ScoreType,IdentScore,LocProb,Log2FChange,PQ-val,QuantSig,PEP,MassErrorPPM
ASLLDKAKDFVADKLTAIPKPE,nta,A,2,true,"Arabidopsis translation initiation landscape - NTA",167a,35069635,,,,,,,,
ASLLDKAK,ph,S,3,true,"Tissue atlas Arabidopsis - ProteomicsDB",114,32188942,"MaxQuant score",120.0900000,1.0000000,,,,0.00063735397998244,
ASLLDKAK,ac,K,7,true,"Quantitative Acetylproteomics",101,29440448,,,,,,,,
LTAIPKPEGSVTDVDLKDVNR,ph,S,25,true,"Tissue atlas Arabidopsis - ProteomicsDB",114,32188942,"MaxQuant score",125.0000000,0.8867210,,,,2.7049999238518E-18,
LTAIPKPEGSVTDVDLK,ph,S,25,true,"Large-scale phosphorylation discovery",44,23111157,XCorr,3.7030000,,,,,,
VSVTNPYSHSIPICEISFTFHSAGR,so,C,58,true,"S-sulfenylation site detection using YAP1C",110,32714340,,,,,,,,
GKIPDPGSLK,ub,K,75,true,"upl3 mutant / wildtype",168,35926874,"MaxQuant score",57.5320000,1.0000000,0.7604339,0.3346800,NO,0.015506899915636,0.2460500
IPDPGSLKAK,ac,K,83,true,"Quantitative Acetylproteomics",101,29440448,,,,,,,,
SILFNLAR,nt,S,99,true,"Arabidopsis translation initiation landscape - NT",167b,35069635,,,,,,,,
