Peptide,PTM,ModifiedAA,ModifiedPosition,PeptideUniqueToGene,ExperimentDesc,ExpID,PubmedID,ScoreType,IdentScore,LocProb,Log2FChange,PQ-val,QuantSig,PEP,MassErrorPPM
TSGDVYGADTGSSRSDEDRGFK,ph,T,12,true,"TOR Kinase and ABA Receptor",100,29290610,XCorr,3.8342237,0.8433000,,,,9.4559996796306E-5,
TSGDVYGADTGSSRSDEDR,ph,T,12,true,"atm and atr DNA damage response",88,25561503,"MASCOT Score",24.0000000,1.0000000,,,,,-0.0900000
TSGDVYGADTGSSRSDEDR,ph,S,14,true,"atm and atr DNA damage response",88,25561503,"MASCOT Score",45.0000000,0.9960000,,,,,-0.8800000
TSGDVYGADTGSSRSDEDR,ph,S,17,true,"atm and atr DNA damage response",88,25561503,"MASCOT Score",45.0000000,0.9960000,,,,,-0.8800000
TSGDVYGADTGSSRSDEDR,ph,S,17,true,"TOR Kinase and ABA Receptor",100,29290610,XCorr,3.3272688,0.8653000,,,,0.020800000056624,
TSGDVYGADTGSSRSDEDR,ph,S,17,true,"Tissue atlas Arabidopsis - ProteomicsDB",114,32188942,"MaxQuant score",150.1400000,0.8515270,,,,1.2243199508071E-18,
GFKEDLNESATSPMR,ph,S,30,true,"atm and atr DNA damage response",88,25561503,"MASCOT Score",21.0000000,0.9910000,,,,,0.9100000
GFKEDLNESATSPMR,ph,S,33,true,"Large-scale phosphorylation discovery",44,23111157,XCorr,4.4290000,,,,,,
GFKEDLNESATSPMR,ph,S,33,true,"SnRK2 protein kinase substrates",85,23776212,XCorr,3.5882232,0.9980000,,,,2.5610700227219E-9,
GFKEDLNESATSPMR,ph,S,33,true,"Tissue atlas Arabidopsis - ProteomicsDB",114,32188942,"MaxQuant score",257.9500000,0.9995270,,,,0,
EDLNESATSPMR,ph,S,33,true,"atm and atr DNA damage response",88,25561503,"MASCOT Score",32.0000000,1.0000000,,,,,0.1500000
EDLNESATSPMR,ph,S,33,true,"TOR Kinase and ABA Receptor",100,29290610,XCorr,3.2355945,0.9862000,,,,1.194000014948E-5,
EDLNESATSPMR,ph,S,33,true,"Phospho cell culture sucrose/TOR",109,30833711,,,0.9407470,,,,,
NRLDDSNSRPGSQR,ph,S,44,true,"Tissue atlas Arabidopsis - ProteomicsDB",114,32188942,"MaxQuant score",112.8200000,0.9596910,,,,2.1709300199291E-5,
LDDSNSRPGSQR,ph,S,44,true,"atm and atr DNA damage response",88,25561503,"MASCOT Score",29.0000000,1.0000000,,,,,-0.1200000
LDDSNSRPGSQR,ph,S,48,true,"atm and atr DNA damage response",88,25561503,"MASCOT Score",27.0000000,1.0000000,,,,,-0.7100000
LDDSNSRPGSQR,ph,S,48,true,"Tissue atlas Arabidopsis - ProteomicsDB",114,32188942,"MaxQuant score",107.8200000,0.9995590,,,,1.9655899450299E-5,
KEEETDSDSSSSK,ph,T,61,true,"atm and atr DNA damage response",88,25561503,"MASCOT Score",53.0000000,1.0000000,,,,,0.5400000
KEEETDSDSSSSK,ph,S,63,true,"atm and atr DNA damage response",88,25561503,"MASCOT Score",53.0000000,1.0000000,,,,,0.5400000
KLDSIKDHLLR,ph,S,94,true,"MAPK Arabidopsis substrates",45,23172892,"MaxQuant Score",117.7900000,,,,,,
LDSIKDHLLR,ph,S,94,false,"atm and atr DNA damage response",88,25561503,"MASCOT Score",31.0000000,1.0000000,,,,,-0.6100000
LDSIKDHLLR,ph,S,94,false,"Tissue atlas Arabidopsis - ProteomicsDB",114,32188942,"MaxQuant score",127.3000000,1.0000000,,,,3.3625599371589E-6,
FFPGTPSR,ph,S,212,true,"atm and atr DNA damage response",88,25561503,"MASCOT Score",25.0000000,0.9970000,,,,,-0.4200000
YGDVPFSPALHHGEK,ph,S,220,true,"TOR Kinase and ABA Receptor",100,29290610,XCorr,2.6785462,1.0000000,,,,0.0084690004587173,
YGDVPFSPALHHGEK,ph,S,220,true,"Tissue atlas Arabidopsis - ProteomicsDB",114,32188942,"MaxQuant score",97.3200000,1.0000000,,,,7.4503100222501E-6,
VGPFSPHGGVHTR,ph,S,233,true,"atm and atr DNA damage response",88,25561503,"MASCOT Score",43.0000000,1.0000000,,,,,-1.0300000
VGPFSPHGGVHTR,ph,S,233,true,"Tissue atlas Arabidopsis - ProteomicsDB",114,32188942,"MaxQuant score",127.8300000,0.9999990,,,,1.704369969957E-5,
GYVQQAVSDTDSRR,ph,S,264,true,"Tissue atlas Arabidopsis - ProteomicsDB",114,32188942,"MaxQuant score",183.0600000,0.9951100,,,,6.5720398337681E-22,
GYVQQAVSDTDSR,ph,S,264,true,"atm and atr DNA damage response",88,25561503,"MASCOT Score",77.0000000,0.9970000,,,,,-0.0600000
IVHAVSPSDHSNDEDR,ph,S,375,true,"atm and atr DNA damage response",88,25561503,"MASCOT Score",69.0000000,0.9430000,,,,,-0.2300000
IVHAVSPSDHSNDEDR,ph,S,375,true,"Tissue atlas Arabidopsis - ProteomicsDB",114,32188942,"MaxQuant score",172.6000000,0.9971890,,,,5.9083197633887E-20,
IVHAVSPSDHSNDEDR,ph,S,380,true,"Large-scale phosphorylation discovery",44,23111157,XCorr,3.6120000,,,,,,
IVHAVSPSDHSNDEDR,ph,S,380,true,"atm and atr DNA damage response",88,25561503,"MASCOT Score",44.0000000,1.0000000,,,,,-0.3300000
IVHAVSPSDHSNDEDR,ph,S,380,true,"Tissue atlas Arabidopsis - ProteomicsDB",114,32188942,"MaxQuant score",84.3240000,0.9863380,,,,0.00012579199392349,
SNLLELFEYSNVNR,ph,S,427,true,"Large-scale phosphorylation discovery",44,23111157,XCorr,3.5880000,,,,,,
SNLLELFEYSNVNR,ph,S,427,true,"MAPK Arabidopsis substrates",45,23172892,"MaxQuant Score",181.5800000,,,,,,
