Peptide,PTM,ModifiedAA,ModifiedPosition,PeptideUniqueToGene,ExperimentDesc,ExpID,PubmedID,ScoreType,IdentScore,LocProb,Log2FChange,PQ-val,QuantSig,PEP,MassErrorPPM
SDSGEPKPSQQEEPLPQPAAQE,nta,S,2,true,"HUNTER N-terminome: legumain, GluC and trypsin",119,31951383,"MaxQuant score",85.8050000,,,,,,
SDSGEPKPSQQEEPLPQPAAQE,nta,S,2,true,"Arabidopsis translation initiation landscape - NTA",167a,35069635,,,,,,,,
TIDADEEDGDSKSESSILQNLK,ph,S,56,false,"Tissue atlas Arabidopsis - ProteomicsDB",114,32188942,"MaxQuant score",136.8300000,0.8134430,,,,6.6198497382716E-29,
TIDADEEDGDSKSESSILQNLK,ph,S,58,false,"Tissue atlas Arabidopsis - ProteomicsDB",114,32188942,"MaxQuant score",230.7100000,0.9553650,,,,0,
SVFHYDSSK,ph,S,102,true,"Tissue atlas Arabidopsis - ProteomicsDB",114,32188942,"MaxQuant score",107.3400000,0.9766830,,,,0.00059202901320532,
EQTISSEKAGGSHGPLR,ub,K,179,false,"Arabidopsis ubiquitination COFRADIC",40,26744219,"MaxQuant Score",120.6300000,1.0000000,,,,4.7230001323384E-30,0.9100000
AMGVEDEDDEADKDSDEDENALPFACFICR,ph,S,266,true,"srk2dei ABA signaling phopshoproteomics",83,23572148,"MASCOT Score",73.0000000,,,,,,-0.0007000
AMGVEDEDDEADKDSDEDENALPFACFICR,ph,S,266,true,"SnRK2 protein kinase substrates",85,23776212,XCorr,4.2666392,1.0000000,,,,0.0057088499888778,
SKAEQGL,ub,K,338,false,"Arabidopsis ubiquitination COFRADIC",40,26744219,"MaxQuant Score",92.4700000,1.0000000,,,,0.003000000026077,-0.5270000
