Peptide,PTM,ModifiedAA,ModifiedPosition,PeptideUniqueToGene,ExperimentDesc,ExpID,PubmedID,ScoreType,IdentScore,LocProb,Log2FChange,PQ-val,QuantSig,PEP,MassErrorPPM
SDSVKSAQVK,ac,K,132,true,"Quantitative Acetylproteomics",101,29440448,,,,,,,,
QSDTSPPPSPASK,ph,S,149,true,"STN8 phosphoproteome",38,21768351,"MASCOT Score",51.3500000,,,,,,0.0678587
QSDTSPPPSPASK,ph,S,149,true,"Chloroplast kinase substrates",60,19376835,"MASCOT Score",50.1100000,,,,,,-0.5555120
QSDTSPPPSPASK,ph,S,149,true,"LAXIC - ABA stress",84a,23660473,XCorr,2.9800000,0.8740000,,,,0.10234999656677,
QSDTSPPPSPASK,ph,S,149,true,"LAXIC - mannitol vs control",84b,23660473,XCorr,3.4500000,0.8400000,,,,0.00034178499481641,
QSDTSPPPSPASK,ph,S,149,true,"SnRK2 protein kinase substrates",85,23776212,XCorr,3.7639933,0.9860000,,,,0.017160799354315,
QSDTSPPPSPASK,ph,S,149,true,"atm and atr DNA damage response",88,25561503,"MASCOT Score",48.0000000,0.9480000,,,,,-1.5700000
QSDTSPPPSPASK,ph,S,149,true,"TOR Kinase and ABA Receptor",100,29290610,XCorr,3.7319567,0.9930000,,,,4.891999924439E-5,
QSDTSPPPSPASK,ph,S,149,true,"Tissue atlas Arabidopsis - ProteomicsDB",114,32188942,"MaxQuant score",236.2600000,0.9999720,,,,0,
QSDTSPPPSPASK,ph,S,153,true,"SnRK2 protein kinase substrates",85,23776212,XCorr,3.7639933,0.9980000,,,,0.017160799354315,
QSDTSPPPSPASK,ph,S,153,true,"atm and atr DNA damage response",88,25561503,"MASCOT Score",48.0000000,1.0000000,,,,,-1.5700000
QSDTSPPPSPASK,ph,S,153,true,"Tissue atlas Arabidopsis - ProteomicsDB",114,32188942,"MaxQuant score",191.8300000,0.9999900,,,,2.2794599644366E-30,
DTVVDEAGETSHSFPK,ph,S,170,true,"Tissue atlas Arabidopsis - ProteomicsDB",114,32188942,"MaxQuant score",244.1000000,0.9940700,,,,0,
LVHIEGCR,sno,C,228,true,"hot5-4 / wildtype, FAT-switch S-nitrosoproteome",169,37277371,,,,-0.3878026,0.1829946,NO,,
LVHIEGCR,so,C,228,true,"Arabidopsis S-sulfenylation chemoproteomics",108,31578252,"pFind PSM Score",0.1925210,,,,,,-0.3547475
LEGEEIDRDSIMR,ph,S,548,true,"Tissue atlas Arabidopsis - ProteomicsDB",114,32188942,"MaxQuant score",94.3660000,1.0000000,,,,7.7397198765539E-5,
VEGLGKPLKSLNSSK,ph,S,594,true,"Tissue atlas Arabidopsis - ProteomicsDB",114,32188942,"MaxQuant score",157.8500000,0.9929730,,,,9.7625000531482E-13,
PLKSLNSSK,ph,S,594,true,"atm and atr DNA damage response",88,25561503,"MASCOT Score",32.0000000,0.9890000,,,,,-4.4200000
KTDVSSPKTPQTALSSQVDAVSSEADTAASLQSDAEK,ph,S,606,true,"Tissue atlas Arabidopsis - ProteomicsDB",114,32188942,"MaxQuant score",244.6200000,0.8444500,,,,0,
KTDVSSPK,ph,S,606,true,"atm and atr DNA damage response",88,25561503,"MASCOT Score",33.0000000,0.9300000,,,,,-0.9900000
TPQTALSSQVDAVSSEADTAASLQSDAEK,ph,S,630,true,"TOR Kinase and ABA Receptor",100,29290610,XCorr,6.5969162,0.8744000,,,,7.4950001760499E-10,
QAACSSADGR,sno,C,875,true,"hot5-4 / wildtype, FAT-switch S-nitrosoproteome",169,37277371,,,,,,,,
QATIYQQKALDIN,nt,Q,940,false,"HUNTER N-terminome: legumain, GluC and trypsin",119,31951383,"MaxQuant score",73.8480000,,,,,,
NGTPKPDASIASK,ph,T,1114,true,"atm and atr DNA damage response",88,25561503,"MASCOT Score",48.0000000,1.0000000,,,,,-1.8700000
NGTPKPDASIASK,ph,T,1114,true,"TOR Kinase and ABA Receptor",100,29290610,XCorr,2.5306554,1.0000000,,,,1.4840000403638E-5,
NGTPKPDASIASK,ph,T,1114,true,"Tissue atlas Arabidopsis - ProteomicsDB",114,32188942,"MaxQuant score",102.3900000,0.9999980,,,,0.0010241100098938,
GHLSVSDLLDYINPSHNAK,ph,S,1128,true,"TOR Kinase and ABA Receptor",100,29290610,XCorr,5.4746528,0.9932000,,,,3.0859999000654E-9,
SKQSNVSEHLVEIPR,ph,S,1166,true,"TOR Kinase and ABA Receptor",100,29290610,XCorr,2.8018866,0.9872000,,,,0.00040700001409277,
SKQSNVSEHLVEIPR,ph,S,1166,true,"Tissue atlas Arabidopsis - ProteomicsDB",114,32188942,"MaxQuant score",62.0640000,0.7712530,,,,0.00033315698965453,
QKEMSEEDTEETGSEEGK,ph,S,1184,true,"atm and atr DNA damage response",88,25561503,"MASCOT Score",81.0000000,1.0000000,,,,,-0.4400000
EMSEEDTEETGSEEGK,ph,S,1184,true,"Tissue atlas Arabidopsis - ProteomicsDB",114,32188942,"MaxQuant score",292.1300000,1.0000000,,,,0,
QKEMSEEDTEETGSEEGK,ph,S,1193,true,"Tissue atlas Arabidopsis - ProteomicsDB",114,32188942,"MaxQuant score",395.4200000,0.9996330,,,,0,
EMSEEDTEETGSEEGK,ph,S,1193,true,"atm and atr DNA damage response",88,25561503,"MASCOT Score",73.0000000,0.9940000,,,,,-0.8800000
EMSEEDTEETGSEEGK,ph,S,1193,true,"TOR Kinase and ABA Receptor",100,29290610,XCorr,6.9141383,0.9999000,,,,7.7179995727761E-9,
KNVEADIDNPLFQNATQQNDK,ub,K,1281,true,"upl3 mutant / wildtype",168,35926874,"MaxQuant score",121.2100000,1.0000000,,,,2.700800021825E-16,-2.4711000
TASYSSYADHHSPGLTTQGTK,ph,S,1311,true,"Tissue atlas Arabidopsis - ProteomicsDB",114,32188942,"MaxQuant score",138.5400000,0.9997820,,,,5.3787502634972E-23,
TASYSSYADHHSPGLTTQGTK,ph,S,1313,true,"Tissue atlas Arabidopsis - ProteomicsDB",114,32188942,"MaxQuant score",80.0820000,0.9229960,,,,2.0075799511687E-6,
RTASYSSYADHHSPGLTTQGTK,ph,S,1320,true,"TOR Kinase and ABA Receptor",100,29290610,XCorr,4.5582318,0.7972000,,,,0.00016680000408087,
TASYSSYADHHSPGLTTQGTK,ph,S,1320,true,"atm and atr DNA damage response",88,25561503,"MASCOT Score",24.0000000,0.9910000,,,,,0.4500000
TASYSSYADHHSPGLTTQGTK,ph,S,1320,true,"Tissue atlas Arabidopsis - ProteomicsDB",114,32188942,"MaxQuant score",192.6200000,0.9973780,,,,0,
VKSTQPSSGNAK,ub,K,1343,true,"Arabidopsis ubiquitination by TUBEs",2,23667124,,,,,,,,
TAGETSEEDGLKTDASSVEPPTLSSTVQSEAYHTK,ph,T,1354,true,"SnRK2 protein kinase substrates",85,23776212,XCorr,3.7755280,0.9320000,,,,2.1544899198034E-8,
TAGETSEEDGLKTDASSVEPPTLSSTVQSEAYHTK,ph,T,1358,true,"SnRK2 protein kinase substrates",85,23776212,XCorr,3.7755280,0.9320000,,,,2.1544899198034E-8,
TAGETSEEDGLK,ph,T,1358,true,"Chloroplast kinase substrates",60,19376835,"MASCOT Score",34.9900000,,,,,,-0.2743350
TAGETSEEDGLK,ph,T,1358,true,"LAXIC - mannitol vs control",84b,23660473,XCorr,3.5600000,1.0000000,,,,0.0007005570223555,
TAGETSEEDGLK,ph,T,1358,true,"atm and atr DNA damage response",88,25561503,"MASCOT Score",69.0000000,1.0000000,,,,,-0.5200000
TAGETSEEDGLK,ph,T,1358,true,"Tissue atlas Arabidopsis - ProteomicsDB",114,32188942,"MaxQuant score",197.6700000,1.0000000,,,,0,
TAGETSEEDGLK,ph,S,1359,true,"STN8 phosphoproteome",38,21768351,"MASCOT Score",38.9900000,,,,,,0.4141210
TAGETSEEDGLK,ph,S,1359,true,"Chloroplast kinase substrates",60,19376835,"MASCOT Score",34.9900000,,,,,,-0.2743350
TAGETSEEDGLK,ph,S,1359,true,"LAXIC - ABA stress",84a,23660473,XCorr,2.8300000,0.9560000,,,,0.22261999547482,
TAGETSEEDGLK,ph,S,1359,true,"LAXIC - mannitol vs control",84b,23660473,XCorr,3.5600000,1.0000000,-1.0281338,,NO,0.0007005570223555,
TAGETSEEDGLK,ph,S,1359,true,"SnRK2 protein kinase substrates",85,23776212,XCorr,2.5754101,0.9970000,,,,0.00031552198925056,
TAGETSEEDGLK,ph,S,1359,true,"atm and atr DNA damage response",88,25561503,"MASCOT Score",69.0000000,1.0000000,,,,,-0.5200000
TAGETSEEDGLK,ph,S,1359,true,"TOR Kinase and ABA Receptor",100,29290610,XCorr,3.5691967,0.9935000,,,,0.00019180000526831,
TAGETSEEDGLK,ph,S,1359,true,"Tissue atlas Arabidopsis - ProteomicsDB",114,32188942,"MaxQuant score",285.5700000,1.0000000,,,,0,
SPSYKEVALAPPGSIAK,ph,S,1397,true,"SnRK2 protein kinase substrates",85,23776212,XCorr,3.2463515,0.8520000,,,,5.8176401473986E-9,
NSVVSLGKSPSYK,ph,S,1397,true,"atm and atr DNA damage response",88,25561503,"MASCOT Score",43.0000000,1.0000000,,,,,-1.9300000
NSVVSLGKSPSYK,ph,S,1397,true,"Tissue atlas Arabidopsis - ProteomicsDB",114,32188942,"MaxQuant score",212.0200000,0.9996380,,,,2.2745806607997E-39,
NSVVSLGKSPSYK,ph,S,1397,true,"Touch-induced phosphorylation: 40s touch vs untouc",136,30291188,"MASCOT score",70.2700000,,-0.1895249,0.2162123,NO,,-2.2912384
NSVVSLGKSPSYKEVALAPPGSIAK,ph,S,1399,true,"MAPK Arabidopsis substrates",45,23172892,"MaxQuant Score",114.9000000,,,,,,
SPSYKEVALAPPGSIAK,ph,S,1399,true,"MAPK Arabidopsis substrates",45,23172892,"MaxQuant Score",115.9800000,,,,,,
SPSYKEVALAPPGSIAK,ph,S,1399,true,"atm and atr DNA damage response",88,25561503,"MASCOT Score",26.0000000,0.9960000,,,,,-3.2400000
SPSYKEVALAPPGSIAK,ph,S,1399,true,"Tissue atlas Arabidopsis - ProteomicsDB",114,32188942,"MaxQuant score",211.4000000,0.9999780,,,,0,
SPSYKEVALAPPGSIAK,ph,Y,1400,true,"Chloroplast kinase substrates",60,19376835,"MASCOT Score",36.9900000,,,,,,-1.8086000
EVALAPPGSIAK,ph,S,1410,true,"Tissue atlas Arabidopsis - ProteomicsDB",114,32188942,"MaxQuant score",131.6900000,1.0000000,,,,3.5392298741499E-5,
YQVWVPQAEVSDKQEDDEMEK,ph,S,1424,true,"TOR Kinase and ABA Receptor",100,29290610,XCorr,3.7744279,1.0000000,,,,0.026469999924302,
YQVWVPQAEVSDKQEDDEMEK,ph,S,1424,true,"Tissue atlas Arabidopsis - ProteomicsDB",114,32188942,"MaxQuant score",49.1410000,0.9999840,,,,0.00049505202332512,
YQVWVPQAEVSDK,ph,S,1424,true,"srk2dei ABA signaling phopshoproteomics",83,23572148,"MASCOT Score",32.0000000,,,,,,0.0009000
KTEQGTSMELTRDEQMITGLEEEVK,ph,T,1436,true,"TOR Kinase and ABA Receptor",100,29290610,XCorr,4.4817057,0.9936000,,,,1.5580000763293E-5,
TEQGTSMELTR,ph,S,1441,true,"Tissue atlas Arabidopsis - ProteomicsDB",114,32188942,"MaxQuant score",87.2160000,0.8547740,,,,0.00017448600556236,
QQVIDQLAADSE,nt,Q,1528,true,"HUNTER N-terminome: legumain, GluC and trypsin",119,31951383,"MaxQuant score",123.5100000,,,,,,
EQQVIDQLAADSEDLK,ph,S,1538,true,"Tissue atlas Arabidopsis - ProteomicsDB",114,32188942,"MaxQuant score",119.4800000,1.0000000,,,,1.4215599719591E-7,
LSISTTDSGDASR,ph,T,1550,true,"Tissue atlas Arabidopsis - ProteomicsDB",114,32188942,"MaxQuant score",89.2600000,0.8511890,,,,0.0011835800250992,
LSISTTDSGDASR,ph,S,1552,true,"Tissue atlas Arabidopsis - ProteomicsDB",114,32188942,"MaxQuant score",131.8600000,0.9808330,,,,5.9126101405127E-5,
LSASAAPFNPSSPPSIIR,ph,S,1576,true,"Tissue atlas Arabidopsis - ProteomicsDB",114,32188942,"MaxQuant score",270.9900000,0.9912380,,,,0,
VIRDSEAPK,nt,V,1786,true,"Metacaspase9 substrates - 35S:MC9 / mc9",51b,23964026,"MASCOT Score",46.0000000,,1.3562776,,NO,,-0.7747520
DSEAPKSVA,ph,S,1795,true,"atm and atr DNA damage response",88,25561503,"MASCOT Score",24.0000000,1.0000000,,,,,-0.5400000
