Peptide,PTM,ModifiedAA,ModifiedPosition,PeptideUniqueToGene,ExperimentDesc,ExpID,PubmedID,ScoreType,IdentScore,LocProb,Log2FChange,PQ-val,QuantSig,PEP,MassErrorPPM
QVREDGLLHTACGTPNYVAPEVLSDK,ph,T,178,true,"TOR Kinase and ABA Receptor",100,29290610,XCorr,3.6101246,0.9656000,,,,0.00099910004064441,
EDGLLHTACGTPNYVAPEVLSDK,ph,T,178,true,"srk2dei ABA signaling phopshoproteomics",83,23572148,"MASCOT Score",52.0000000,,,,,,0.0009000
EDGLLHTACGTPNYVAPEVLSDK,ph,T,178,true,"SnRK2 protein kinase substrates",85,23776212,XCorr,3.0634992,0.9990000,,,,0.0048902197740972,
EDGLLHTACGTPNYVAPEVLSDK,ph,T,178,true,"TOR Kinase and ABA Receptor",100,29290610,XCorr,4.4844160,0.8532000,,,,3.2529999316466E-6,
EDGLLHTACGTPNYVAPEVLSDK,ph,T,178,true,"Tissue atlas Arabidopsis - ProteomicsDB",114,32188942,"MaxQuant score",349.8500000,1.0000000,,,,0,
EDGLLHTACGTPNYVAPEVLSDK,ph,T,182,true,"srk2dei ABA signaling phopshoproteomics",83,23572148,"MASCOT Score",46.0000000,,,,,,0.0004000
SASEIMSK,ph,S,353,true,"atm and atr DNA damage response",88,25561503,"MASCOT Score",31.0000000,1.0000000,,,,,-4.0700000
SASEIMSK,ph,S,355,true,"atm and atr DNA damage response",88,25561503,"MASCOT Score",27.0000000,1.0000000,,,,,-3.0800000
SASEIMSK,ph,S,355,true,"Tissue atlas Arabidopsis - ProteomicsDB",114,32188942,"MaxQuant score",78.6550000,0.9997040,,,,0.0029289401136339,
KTGGDTLEFHK,ph,T,417,true,"atm and atr DNA damage response",88,25561503,"MASCOT Score",37.0000000,1.0000000,,,,,-1.0700000
TGGDTLEFHK,ph,T,417,true,"atm and atr DNA damage response",88,25561503,"MASCOT Score",36.0000000,1.0000000,,,,,-1.3000000
TGGDTLEFHK,ph,T,417,true,"Tissue atlas Arabidopsis - ProteomicsDB",114,32188942,"MaxQuant score",242.4500000,1.0000000,,,,0,
GDTLEFHK,ph,T,417,false,"atm and atr DNA damage response",88,25561503,"MASCOT Score",35.0000000,1.0000000,,,,,-0.6700000
GDTLEFHK,ph,T,417,false,"Tissue atlas Arabidopsis - ProteomicsDB",114,32188942,"MaxQuant score",109.6600000,1.0000000,,,,0.010274999774992,
