Peptide,PTM,ModifiedAA,ModifiedPosition,PeptideUniqueToGene,ExperimentDesc,ExpID,PubmedID,ScoreType,IdentScore,LocProb,Log2FChange,PQ-val,QuantSig,PEP,MassErrorPPM
YLQDLSDRQSMSR,ph,S,53,true,"Tissue atlas Arabidopsis - ProteomicsDB",114,32188942,"MaxQuant score",109.0400000,0.9186590,,,,3.6501598515315E-5,
EGSSAAEDWDDRPHTIDAVK,ph,S,59,true,"Tissue atlas Arabidopsis - ProteomicsDB",114,32188942,"MaxQuant score",56.9470000,0.9999870,,,,0.00026748201344162,
EGSSAAEDWDDRPHTIDAVK,ph,S,60,true,"Tissue atlas Arabidopsis - ProteomicsDB",114,32188942,"MaxQuant score",50.9450000,0.9999840,,,,0.0013185800053179,
TNLSQAFSQK,ph,S,99,true,"atm and atr DNA damage response",88,25561503,"MASCOT Score",39.0000000,1.0000000,,,,,-0.9500000
TNLSQAFSQK,ph,S,99,true,"Tissue atlas Arabidopsis - ProteomicsDB",114,32188942,"MaxQuant score",226.5300000,1.0000000,,,,3.3945900608285E-36,
GQRPSSPSR,ph,S,178,true,"atm and atr DNA damage response",88,25561503,"MASCOT Score",27.0000000,0.9330000,,,,,-0.8500000
NNFSATPSPAK,ph,S,198,true,"Tissue atlas Arabidopsis - ProteomicsDB",114,32188942,"MaxQuant score",112.9500000,0.9508140,,,,3.150320117129E-5,
AAYSYTSNTPSLR,ph,S,228,true,"Tissue atlas Arabidopsis - ProteomicsDB",114,32188942,"MaxQuant score",116.9000000,0.9980680,,,,7.9100398579612E-5,
AAYSYTSNTPSLR,ph,S,235,true,"Tissue atlas Arabidopsis - ProteomicsDB",114,32188942,"MaxQuant score",201.0600000,0.9990230,,,,8.8974501599827E-32,
SNYSFTAR,ph,S,241,false,"atm and atr DNA damage response",88,25561503,"MASCOT Score",46.0000000,0.9940000,,,,,0.0200000
SNYSFTAR,ph,S,241,false,"TOR Kinase and ABA Receptor",100,29290610,XCorr,2.8254223,0.9870000,,,,0.044849999248981,
SNYSFTAR,ph,S,241,false,"Tissue atlas Arabidopsis - ProteomicsDB",114,32188942,"MaxQuant score",162.6400000,0.9999650,,,,0.0010048300027847,
