Peptide,PTM,ModifiedAA,ModifiedPosition,PeptideUniqueToGene,ExperimentDesc,ExpID,PubmedID,ScoreType,IdentScore,LocProb,Log2FChange,PQ-val,QuantSig,PEP,MassErrorPPM
STVGELACSY,nt,S,2,false,"Stromal N-terminome",96,26371235,"MASCOT Score",42.5000000,,,,,,
STVGELACSY,nt,S,2,false,"Arg/N-end rule seed, prt6 vs. Wt",99,29168982,"MASCOT Score",41.0900000,,1.3849585,0.0962116,NO,0.09103000164032,-1.7499636
STVGELACSYAVMILE,nta,S,2,false,"Arabidopsis translation initiation landscape - NTA",167a,35069635,,,,,,,,
STVGELACSY,nta,S,2,false,"Arg/N-end rule pathway Roots",80,25728785,"MASCOT Score",80.7700000,,,,,8.4270002844278E-5,
STVGELACSY,nta,S,2,false,"Stromal N-terminome",96,26371235,"MASCOT Score",42.5000000,,,,,,
STVGELACSY,nta,S,2,false,"Arg/N-end rule seed, prt6 vs. Wt",99,29168982,"MASCOT Score",31.9400000,,,,,0.14790000021458,2.6317938
SYAVMILE,nt,S,10,false,"Arg/N-end rule seed, prt6 vs. Wt",99,29168982,"MASCOT Score",63.0700000,,-0.7049070,0.3919325,NO,0.0063330000266433,-0.9069645
AAGVSIESYWPMLFAK,ph,S,41,true,"TOR Kinase and ABA Receptor",100,29290610,XCorr,4.3022313,0.9250000,,,,4.3800000639749E-6,
AKMAEKR,nt,A,48,false,"Arabidopsis translation initiation landscape - NT",167b,35069635,,,,,,,,
AAAPAAGGGAAAAPAAE,nt,A,75,true,"Arg/N-end rule seed, prt6 vs. Wt",99,29168982,"MASCOT Score",29.0200000,,-0.7136981,0.1378467,NO,0.054969999939203,-3.4184241
DEPAEESDGDLGFGLFD,nt,D,96,false,"Metacaspase9 substrates - in vitro rMC9",51c,23964026,"MASCOT Score",68.0000000,,6.6234948,,NO,,-0.9033995
KKDEPAEESDGDLGFGLFD,ph,S,102,false,"Arabidopsis root NAA phosphoproteome",18a,27643528,"MaxQuant Score",228.2300000,1.0000000,,,,7.0064923216241E-45,0.2470000
KKDEPAEESDGDLGFGLFD,ph,S,102,false,"Seed phosphorylation",21,16270910,,,,,,,,
KKDEPAEESDGDLGFGLFD,ph,S,102,false,"Phosphorylation Early Elicitor Signaling",23,17317660,,,,,,,,
KKDEPAEESDGDLGFGLFD,ph,S,102,false,"Phosphorylation nuclei-enriched fractions",28,19245862,,,,,,,,
KKDEPAEESDGDLGFGLFD,ph,S,102,false,"Phosphoproteome iron-deficient Arabidopsis roots",41,22438062,"MASCOT Score",65.6100000,,,,,,
KKDEPAEESDGDLGFGLFD,ph,S,102,false,"Phosphoproteomic analysis of seed maturation",42,22440515,"MASCOT Score",77.0000000,,,,,,-1.6300000
KKDEPAEESDGDLGFGLFD,ph,S,102,false,"Large-scale phosphorylation discovery",44,23111157,XCorr,3.9830000,,,,,,
KKDEPAEESDGDLGFGLFD,ph,S,102,false,"MAPK Arabidopsis substrates",45,23172892,"MaxQuant Score",295.6500000,,,,,,
KKDEPAEESDGDLGFGLFD,ph,S,102,false,"Phosphoproteome ethylene-regulated time response",46,24043427,"MASCOT Score",69.5100000,,,,,,-8.7177000
KKDEPAEESDGDLGFGLFD,ph,S,102,false,"PAMP-triggered phosphorylation",48,24601666,"MASCOT Score",74.2700000,,,,,,
KKDEPAEESDGDLGFGLFD,ph,S,102,false,"Tyrosine phosphorylation in Arabidopsis",59,18463617,"MASCOT Score",72.0000000,,,,,,-1.3501618
KKDEPAEESDGDLGFGLFD,ph,S,102,false,"BSK8 and BSL2 regulating sucrose-ph synthase",66,24924143,"MaxQuant Score",311.2700000,,,,,,0.0131200
KKDEPAEESDGDLGFGLFD,ph,S,102,false,"srk2dei ABA signaling phopshoproteomics",83,23572148,"MASCOT Score",99.0000000,,,,,,-0.0016000
KKDEPAEESDGDLGFGLFD,ph,S,102,false,"LAXIC - ABA stress",84a,23660473,XCorr,4.6300000,1.0000000,,,,0.00032118399394676,
KKDEPAEESDGDLGFGLFD,ph,S,102,false,"LAXIC - mannitol vs control",84b,23660473,XCorr,5.5100000,1.0000000,,,,1.869999988191E-10,
KKDEPAEESDGDLGFGLFD,ph,S,102,false,"SnRK2 protein kinase substrates",85,23776212,XCorr,5.5647559,1.0000000,,,,1.0019599594457E-9,
KKDEPAEESDGDLGFGLFD,ph,S,102,false,"SIRK1 phosphorylation",86a,23820729,"MaxQuant Score",309.0800000,1.0000000,,,,0,1.9160000
KKDEPAEESDGDLGFGLFD,ph,S,102,false,"SIRK1 exp - sirk1 mutant vs WT",86b,23820729,,,,-0.6695294,,NO,,
KKDEPAEESDGDLGFGLFD,ph,S,102,false,"SIRK1 exp - 35S:SIRK1 vs WT",86c,23820729,,,,-0.3582060,,NO,,
KKDEPAEESDGDLGFGLFD,ph,S,102,false,"atm and atr DNA damage response",88,25561503,"MASCOT Score",50.0000000,1.0000000,,,,,0.2000000
KKDEPAEESDGDLGFGLFD,ph,S,102,false,"Brassinosteroid-Regulated Phosphorylation Dynamics",94,26187819,"MaxQuant Score",208.4900000,1.0000000,,,,0,1.8900000
KKDEPAEESDGDLGFGLFD,ph,S,102,false,"TOR Kinase and ABA Receptor",100,29290610,XCorr,5.4175577,1.0000000,,,,1.8529999579187E-7,
KKDEPAEESDGDLGFGLFD,ph,S,102,false,"Tyrosine phosphorylation - flg22 vs mock",105,22074104,"MASCOT Score",58.3100000,,,,,,0.6883892
KKDEPAEESDGDLGFGLFD,ph,S,102,false,"Phospho cell culture sucrose/TOR",109,30833711,,,1.0000000,,,,,
KKDEPAEESDGDLGFGLFD,ph,S,102,false,"Tissue atlas Arabidopsis - ProteomicsDB",114,32188942,"MaxQuant score",364.3700000,1.0000000,,,,0,
KDEPAEESDGDLGFGLFD,ph,S,102,false,"Arabidopsis root NAA phosphoproteome",18a,27643528,"MaxQuant Score",228.2300000,1.0000000,,,,7.0064923216241E-45,0.0800000
KDEPAEESDGDLGFGLFD,ph,S,102,false,"Phosphorylation Early Elicitor Signaling",23,17317660,,,,,,,,
KDEPAEESDGDLGFGLFD,ph,S,102,false,"Cytosolic ribosome Ph",26,17934214,,,,,,,,
KDEPAEESDGDLGFGLFD,ph,S,102,false,"Phosphorylation nuclei-enriched fractions",28,19245862,,,,,,,,
KDEPAEESDGDLGFGLFD,ph,S,102,false,"Mitochondrial phosphoproteome",32,19688752,"MASCOT Score",61.2300000,,,,,,1.0963500
KDEPAEESDGDLGFGLFD,ph,S,102,false,"Phosphoproteome iron-deficient Arabidopsis roots",41,22438062,"MASCOT Score",65.7900000,,,,,,
KDEPAEESDGDLGFGLFD,ph,S,102,false,"Phosphoproteomic analysis of seed maturation",42,22440515,"MASCOT Score",76.0000000,,,,,,-2.3400000
KDEPAEESDGDLGFGLFD,ph,S,102,false,"Pollen phosphoproteome Arabidopsis",43,22631563,"MASCOT Score",119.7300000,,,,,,-2.3856700
KDEPAEESDGDLGFGLFD,ph,S,102,false,"MAPK Arabidopsis substrates",45,23172892,"MaxQuant Score",192.6000000,,,,,,
KDEPAEESDGDLGFGLFD,ph,S,102,false,"PAMP-triggered phosphorylation",48,24601666,"MASCOT Score",48.6400000,,,,,,
KDEPAEESDGDLGFGLFD,ph,S,102,false,"Tyrosine phosphorylation in Arabidopsis",59,18463617,"MASCOT Score",91.0000000,,,,,,-1.4852988
KDEPAEESDGDLGFGLFD,ph,S,102,false,"BSK8 and BSL2 regulating sucrose-ph synthase",66,24924143,"MaxQuant Score",265.2700000,,,,,,0.4990100
KDEPAEESDGDLGFGLFD,ph,S,102,false,"srk2dei ABA signaling phopshoproteomics",83,23572148,"MASCOT Score",96.0000000,,,,,,-0.0013000
KDEPAEESDGDLGFGLFD,ph,S,102,false,"LAXIC - ABA stress",84a,23660473,XCorr,5.5400000,1.0000000,,,,4.8399999286186E-11,
KDEPAEESDGDLGFGLFD,ph,S,102,false,"LAXIC - mannitol vs control",84b,23660473,XCorr,5.8300000,1.0000000,,,,4.3000000791257E-16,
KDEPAEESDGDLGFGLFD,ph,S,102,false,"SnRK2 protein kinase substrates",85,23776212,XCorr,5.5533996,1.0000000,,,,9.766250030907E-8,
KDEPAEESDGDLGFGLFD,ph,S,102,false,"SIRK1 phosphorylation",86a,23820729,"MaxQuant Score",342.1900000,1.0000000,,,,0,7.7310000
KDEPAEESDGDLGFGLFD,ph,S,102,false,"SIRK1 exp - sirk1 mutant vs WT",86b,23820729,,,,-1.6994200,,NO,,
KDEPAEESDGDLGFGLFD,ph,S,102,false,"SIRK1 exp - 35S:SIRK1 vs WT",86c,23820729,,,,-0.2473729,,NO,,
KDEPAEESDGDLGFGLFD,ph,S,102,false,"atm and atr DNA damage response",88,25561503,"MASCOT Score",68.0000000,1.0000000,,,,,-1.2200000
KDEPAEESDGDLGFGLFD,ph,S,102,false,"Brassinosteroid-Regulated Phosphorylation Dynamics",94,26187819,"MaxQuant Score",208.4900000,1.0000000,,,,0,-5.9090000
KDEPAEESDGDLGFGLFD,ph,S,102,false,"TOR Kinase and ABA Receptor",100,29290610,XCorr,6.2836137,1.0000000,,,,6.5799997628346E-7,
KDEPAEESDGDLGFGLFD,ph,S,102,false,"Tyrosine phosphorylation - flg22 vs mock",105,22074104,"MASCOT Score",39.8700000,,,,,,1.0923401
KDEPAEESDGDLGFGLFD,ph,S,102,false,"Phosphorylation tonoplast membrane fraction",107,18686298,"MASCOT Score",100.0000000,,,,,,
KDEPAEESDGDLGFGLFD,ph,S,102,false,"Phospho cell culture sucrose/TOR",109,30833711,,,1.0000000,,,,,
KDEPAEESDGDLGFGLFD,ph,S,102,false,"Col-0 callus - FC Col-0 vs. Col-0 Xray",111a,31410901,,76.0500000,,-0.4139192,0.0000000,NO,,0.9310780
KDEPAEESDGDLGFGLFD,ph,S,102,false,"Col-0 X-ray callus - FC Col-0 vs. Col-0 Xray",111b,31410901,,76.0500000,,-0.4139192,0.0000000,NO,,0.9310780
KDEPAEESDGDLGFGLFD,ph,S,102,false,"atm callus - FC atm vs. atm Xray",111c,31410901,,76.0500000,,-0.0801717,0.0000000,NO,,0.9310780
KDEPAEESDGDLGFGLFD,ph,S,102,false,"atm-3 X-ray callus - FC atm vs. atm Xray",111d,31410901,,76.0500000,,-0.0801717,0.0000000,NO,,0.9310780
KDEPAEESDGDLGFGLFD,ph,S,102,false,"Tissue atlas Arabidopsis - ProteomicsDB",114,32188942,"MaxQuant score",296.7300000,1.0000000,,,,0,
DEPAEESDGDLGFGLFD,ph,S,102,false,"Cytosolic ribosome Ph",26,17934214,,,,,,,,
DEPAEESDGDLGFGLFD,ph,S,102,false,"Phosphorylation nuclei-enriched fractions",28,19245862,,,,,,,,
DEPAEESDGDLGFGLFD,ph,S,102,false,"Pollen phosphoproteome Arabidopsis",43,22631563,"MASCOT Score",94.8400000,,,,,,-2.3585300
DEPAEESDGDLGFGLFD,ph,S,102,false,"srk2dei ABA signaling phopshoproteomics",83,23572148,"MASCOT Score",99.0000000,,,,,,0.0003000
DEPAEESDGDLGFGLFD,ph,S,102,false,"LAXIC - ABA stress",84a,23660473,XCorr,4.3500000,1.0000000,,,,3.5599998227553E-5,
DEPAEESDGDLGFGLFD,ph,S,102,false,"LAXIC - mannitol vs control",84b,23660473,XCorr,4.6900000,1.0000000,,,,7.9700002153515E-10,
DEPAEESDGDLGFGLFD,ph,S,102,false,"SnRK2 protein kinase substrates",85,23776212,XCorr,4.1857338,1.0000000,,,,0.0057359598577023,
DEPAEESDGDLGFGLFD,ph,S,102,false,"SIRK1 phosphorylation",86a,23820729,"MaxQuant Score",78.0910000,1.0000000,,,,1.029000043869,0.4610000
DEPAEESDGDLGFGLFD,ph,S,102,false,"atm and atr DNA damage response",88,25561503,"MASCOT Score",98.0000000,1.0000000,,,,,-0.3500000
DEPAEESDGDLGFGLFD,ph,S,102,false,"TOR Kinase and ABA Receptor",100,29290610,XCorr,6.0855670,1.0000000,,,,1.0229999958256E-7,
DEPAEESDGDLGFGLFD,ph,S,102,false,"Lateral root-induction - NAA vs control",106,23328941,"MASCOT Score",74.0000000,,0.0367670,0.9478479,NO,,
DEPAEESDGDLGFGLFD,ph,S,102,false,"Col-0 callus - FC Col-0 vs. Col-0 Xray",111a,31410901,,69.3100000,,0.0789020,0.0000000,NO,,0.6121520
DEPAEESDGDLGFGLFD,ph,S,102,false,"Col-0 X-ray callus - FC Col-0 vs. Col-0 Xray",111b,31410901,,69.3100000,,0.0789020,0.0000000,NO,,0.6121520
DEPAEESDGDLGFGLFD,ph,S,102,false,"atm callus - FC atm vs. atm Xray",111c,31410901,,69.3100000,,0.2337784,0.0000000,NO,,0.6121520
DEPAEESDGDLGFGLFD,ph,S,102,false,"atm-3 X-ray callus - FC atm vs. atm Xray",111d,31410901,,69.3100000,,0.2337784,0.0000000,NO,,0.6121520
DEPAEESDGDLGFGLFD,ph,S,102,false,"Touch-induced phosphorylation: 40s touch vs untouc",136,30291188,"MASCOT score",72.3000000,,-0.1006175,0.0381729,NO,,7.5595745
