Peptide,PTM,ModifiedAA,ModifiedPosition,PeptideUniqueToGene,ExperimentDesc,ExpID,PubmedID,ScoreType,IdentScore,LocProb,Log2FChange,PQ-val,QuantSig,PEP,MassErrorPPM
VQEVVKEKQSTN,nta,V,62,true,"HUNTER N-terminome: legumain, GluC and trypsin",119,31951383,"MaxQuant score",46.7060000,,,,,,
EKQSTNNTSLLITK,ph,S,71,true,"Tissue atlas Arabidopsis - ProteomicsDB",114,32188942,"MaxQuant score",156.9800000,0.9847050,,,,3.9155301223559E-10,
LLTKSDSVVSTYR,ac,K,133,true,"Quantitative Acetylproteomics",101,29440448,,,,,,,,
ATSDPEIWK,ph,S,269,true,"Tissue atlas Arabidopsis - ProteomicsDB",114,32188942,"MaxQuant score",65.6270000,0.9979260,,,,0.015528099611402,
RGEGPTLVECETYR,acy,C,317,true,"Arabidopsis S-acylation atlas - Silique",163e,35681017,,,,,,,,
DAAEKAKYAAR,ub,K,341,true,"Arabidopsis ubiquitination COFRADIC",40,26744219,"MaxQuant Score",41.6890000,0.9380000,,,,0.01799999922514,0.4160000
DPIAALKK,ac,K,352,true,"Quantitative Acetylproteomics",101,29440448,,,,,,,,
EAELKSIEK,ac,K,367,true,"Quantitative Acetylproteomics",101,29440448,,,,,,,,
SQLLENVFADPKGFGIGPDGR,nt,S,393,true,"Arabidopsis translation initiation landscape - NT",167b,35069635,,,,,,,,
SQLLENVFADPKGFGIGPDGR,ub,K,404,true,"Arabidopsis ubiquitination COFRADIC",40,26744219,"MaxQuant Score",41.7980000,1.0000000,,,,4.1809998947429E-5,0.1980000
CEDPKFTEGTAQV,ox,C,416,true,"SPEAR - 10 mM H2O2 / mock",138a,34619326,,,,3.0648267,0.0185386,YES,,
