Peptide,PTM,ModifiedAA,ModifiedPosition,PeptideUniqueToGene,ExperimentDesc,ExpID,PubmedID,ScoreType,IdentScore,LocProb,Log2FChange,PQ-val,QuantSig,PEP,MassErrorPPM
MDTNTSGEELLAK,ph,S,6,true,"atm and atr DNA damage response",88,25561503,"MASCOT Score",54.0000000,0.9990000,,,,,-0.3700000
LVSSASSSQLNQAFLDLEK,ph,S,131,true,"TOR Kinase and ABA Receptor",100,29290610,XCorr,6.4501209,0.9747000,,,,1.2190000120427E-9,
QVSGDIETSK,ph,S,179,true,"Tissue atlas Arabidopsis - ProteomicsDB",114,32188942,"MaxQuant score",73.6550000,0.9979460,,,,0.0044790902175009,
ERLPQSFSPPQVAENVNRK,ph,S,553,true,"TOR Kinase and ABA Receptor",100,29290610,XCorr,2.8940086,0.9733000,,,,0.06479000300169,
ERLPQSFSPPQVAENVNR,ph,S,553,true,"Tissue atlas Arabidopsis - ProteomicsDB",114,32188942,"MaxQuant score",108.1400000,0.9909540,,,,5.7922999729954E-10,
LRLEGEAST,ph,S,644,true,"Tissue atlas Arabidopsis - ProteomicsDB",114,32188942,"MaxQuant score",125.6600000,0.9058970,,,,0.00084475101903081,
LRLEGEAST,ph,T,645,true,"atm and atr DNA damage response",88,25561503,"MASCOT Score",33.0000000,0.9320000,,,,,-0.3800000
LRLEGEAST,ph,T,645,true,"Tissue atlas Arabidopsis - ProteomicsDB",114,32188942,"MaxQuant score",112.8900000,0.8947220,,,,0.00084475101903081,
