Peptide,PTM,ModifiedAA,ModifiedPosition,PeptideUniqueToGene,ExperimentDesc,ExpID,PubmedID,ScoreType,IdentScore,LocProb,Log2FChange,PQ-val,QuantSig,PEP,MassErrorPPM
SEETKDNQRL,nt,S,2,true,"N-term acetylation drought responses",5,26184543,,,,,,,,
SEETKDNQR,nt,S,2,true,"Arg/N-end rule seed, prt6 vs. Wt",99,29168982,"MASCOT Score",23.3900000,,,,,0.024390000849962,-0.6928876
SEETKDNQRLQRPAPRLNERIL,nta,S,2,true,"Arabidopsis translation initiation landscape - NTA",167a,35069635,,,,,,,,
SEETKDNQR,nta,S,2,true,"Arg/N-end rule seed, prt6 vs. Wt",99,29168982,"MASCOT Score",23.3900000,,-0.0866703,0.2707092,NO,0.024390000849962,-0.6928876
SEETKDNQR,ph,S,2,true,"atm and atr DNA damage response",88,25561503,"MASCOT Score",30.0000000,1.0000000,,,,,-0.1100000
ILSSLSRR,ph,S,24,true,"MAPK Arabidopsis substrates",45,23172892,"MaxQuant Score",93.3740000,,,,,,
ILSSLSRR,ph,S,24,true,"Brassinosteroid-Regulated Phosphorylation Dynamics",94,26187819,"MaxQuant Score",121.6000000,0.9970000,,,,7.0549998781644E-5,1.5260000
ILSSLSR,ph,S,24,true,"Arabidopsis root NAA phosphoproteome",18a,27643528,"MaxQuant Score",86.6700000,0.8260000,,,,0.0080000003799796,-0.4690000
ILSSLSR,ph,S,24,true,"Phosphoproteome iron-deficient Arabidopsis roots",41,22438062,"MASCOT Score",30.8100000,,,,,,
ILSSLSR,ph,S,24,true,"PAMP-triggered phosphorylation",48,24601666,"MASCOT Score",35.5200000,,,,,,
ILSSLSR,ph,S,24,true,"srk2dei ABA signaling phopshoproteomics",83,23572148,"MASCOT Score",47.0000000,,,,,,-0.0003000
ILSSLSR,ph,S,24,true,"SnRK2 protein kinase substrates",85,23776212,XCorr,2.2295847,0.9970000,,,,0.040091499686241,
ILSSLSR,ph,S,24,true,"TOR Kinase and ABA Receptor",100,29290610,XCorr,2.8107755,0.9871000,,,,0.0087219998240471,
ILSSLSR,ph,S,24,true,"Lateral root-induction - NAA vs control",106,23328941,"MASCOT Score",22.0000000,,,,,,
ILSSLSR,ph,S,24,true,"Col-0 callus - FC Col-0 vs. Col-0 Xray",111a,31410901,,30.4900000,,1.0631988,0.0000000,NO,,0.5198270
ILSSLSR,ph,S,24,true,"Col-0 X-ray callus - FC Col-0 vs. Col-0 Xray",111b,31410901,,30.4900000,,1.0631988,0.0000000,NO,,0.5198270
ILSSLSR,ph,S,24,true,"atm callus - FC atm vs. atm Xray",111c,31410901,,30.4900000,,-0.4297181,0.0000000,NO,,0.5198270
ILSSLSR,ph,S,24,true,"atm-3 X-ray callus - FC atm vs. atm Xray",111d,31410901,,30.4900000,,-0.4297181,0.0000000,NO,,0.5198270
ILSSLSR,ph,S,24,true,"Tissue atlas Arabidopsis - ProteomicsDB",114,32188942,"MaxQuant score",150.3600000,0.9993350,,,,0.011544100008905,
ILSSLSRR,ph,S,25,true,"MAPK Arabidopsis substrates",45,23172892,"MaxQuant Score",75.2130000,,,,,,
ILSSLSRR,ph,S,25,true,"atm and atr DNA damage response",88,25561503,"MASCOT Score",30.0000000,0.8770000,,,,,-0.3200000
ILSSLSR,ph,S,25,true,"SIRK1 phosphorylation",86a,23820729,"MaxQuant Score",94.1350000,0.7840000,,,,0.24799999594688,3.9790000
ILSSLSR,ph,S,25,true,"Tissue atlas Arabidopsis - ProteomicsDB",114,32188942,"MaxQuant score",102.0700000,0.9229220,,,,0.0060405498370528,
ILSSLSRR,ph,S,27,true,"Brassinosteroid-Regulated Phosphorylation Dynamics",94,26187819,"MaxQuant Score",96.1430000,0.9540000,,,,0.012000000104308,0.3620000
ILSSLSRR,ph,S,27,true,"Tissue atlas Arabidopsis - ProteomicsDB",114,32188942,"MaxQuant score",94.3630000,0.9641590,,,,0.0046125198714435,
VKYELDKK,ac,K,67,false,"Quantitative Acetylproteomics",101,29440448,,,,,,,,
SVVYPHNYGFVPRTLCE,nt,S,81,false,"Arabidopsis translation initiation landscape - NT",167b,35069635,,,,,,,,
ILYSSVVYPHNYGFVPR,ph,S,81,false,"Tissue atlas Arabidopsis - ProteomicsDB",114,32188942,"MaxQuant score",87.4900000,0.8411420,,,,3.3877600799315E-5,
IIAVCVDDPEYK,sno,C,142,false,"Site-specific nitrosomeproteomic id - gsnor1-3",90b,25699590,XCorr,3.2200000,,,,,0.039850000292063,-6.4200000
IIAVCVDDPEYK,so,C,142,false,"S-sulfenylation site detection using YAP1C",110,32714340,,,,,,,,
RFFEDYKK,ac,K,173,false,"Quantitative Acetylproteomics",101,29440448,,,,,,,,
